builder: mozilla-aurora_win8_64-debug_test-web-platform-tests-2 slave: t-w864-ix-303 starttime: 1482424340.37 results: failure (2) buildid: 20161222065253 builduid: 312821edbfa04af3ab3dd3d065421b0c revision: 2805e2b6c22f55a9155a9f55ede9caa53508bdff ========= Started set props: master (results: 0, elapsed: 0 secs) (at 2016-12-22 08:32:20.369720) ========= master: http://buildbot-master126.bb.releng.scl3.mozilla.com:8201/ ========= Finished set props: master (results: 0, elapsed: 0 secs) (at 2016-12-22 08:32:20.370139) ========= ========= Started downloading to buildprops.json (results: 0, elapsed: 0 secs) (at 2016-12-22 08:32:20.370419) ========= ========= Finished downloading to buildprops.json (results: 0, elapsed: 0 secs) (at 2016-12-22 08:32:20.484465) ========= ========= Started 'bash -c ...' (results: 0, elapsed: 4 secs) (at 2016-12-22 08:32:20.484866) ========= 'bash' '-c' 'wget -Oarchiver_client.py --no-check-certificate --tries=10 --waitretry=3 https://hg.mozilla.org/build/tools/raw-file/default/buildfarm/utils/archiver_client.py' in dir C:\slave\test\. (timeout 1200 secs) watching logfiles {} argv: ['bash', '-c', 'wget -Oarchiver_client.py --no-check-certificate --tries=10 --waitretry=3 https://hg.mozilla.org/build/tools/raw-file/default/buildfarm/utils/archiver_client.py'] environment: ALLUSERSPROFILE=C:\ProgramData APPDATA=C:\Users\cltbld.T-W864-IX-303\AppData\Roaming COMMONPROGRAMFILES=C:\Program Files (x86)\Common Files COMMONPROGRAMFILES(X86)=C:\Program Files (x86)\Common Files COMMONPROGRAMW6432=C:\Program Files\Common Files COMPUTERNAME=T-W864-IX-303 COMSPEC=C:\windows\system32\cmd.exe DCLOCATION=SCL3 DNSSUFFIX=wintest.releng.scl3.mozilla.com FP_NO_HOST_CHECK=NO HOMEDRIVE=C: HOMEPATH=\Users\cltbld.T-W864-IX-303 KTS_HOME=C:\Program Files\KTS KTS_VERSION=1.19c LOCALAPPDATA=C:\Users\cltbld.T-W864-IX-303\AppData\Local LOGONSERVER=\\T-W864-IX-303 MONDIR=C:\Monitor_config\ MOZBUILDDIR=C:\mozilla-build\ NUMBER_OF_PROCESSORS=8 OS=Windows_NT OURDRIVE=C: PATH=C:\Program Files (x86)\NVIDIA Corporation\PhysX\Common;C:\windows\system32;C:\windows;C:\windows\System32\Wbem;C:\windows\System32\WindowsPowerShell\v1.0\;C:\mozilla-build\python27;C:\mozilla-build\python27\Scripts;C:\mozilla-build\msys\bin;C:\mozilla-build\vim\vim72;C:\mozilla-build\wget;C:\mozilla-build\info-zip;C:\CoreUtils\bin;C:\mozilla-build\buildbotve\scripts;C:\mozilla-build\hg PATHEXT=.COM;.EXE;.BAT;.CMD;.VBS;.VBE;.JS;.JSE;.WSF;.WSH;.MSC PROCESSOR_ARCHITECTURE=x86 PROCESSOR_ARCHITEW6432=AMD64 PROCESSOR_IDENTIFIER=Intel64 Family 6 Model 30 Stepping 5, GenuineIntel PROCESSOR_LEVEL=6 PROCESSOR_REVISION=1e05 PROGRAMDATA=C:\ProgramData PROGRAMFILES=C:\Program Files (x86) PROGRAMFILES(X86)=C:\Program Files (x86) PROGRAMW6432=C:\Program Files PROMPT=$P$G PSMODULEPATH=C:\windows\system32\WindowsPowerShell\v1.0\Modules\ PUBLIC=C:\Users\Public PWD=C:\slave\test RUNLOGFILE=C:\slave\\runslave.log SLAVEDIR=C:\slave\ SYSTEMDRIVE=C: SYSTEMROOT=C:\windows TEMP=C:\Users\CLTBLD~1.T-W\AppData\Local\Temp TEST1=testie TMP=C:\Users\CLTBLD~1.T-W\AppData\Local\Temp USERDOMAIN=T-W864-IX-303 USERDOMAIN_ROAMINGPROFILE=T-W864-IX-303 USERNAME=cltbld USERPROFILE=C:\Users\cltbld.T-W864-IX-303 WINDIR=C:\windows using PTY: False --08:32:21-- https://hg.mozilla.org/build/tools/raw-file/default/buildfarm/utils/archiver_client.py => `archiver_client.py' Resolving hg.mozilla.org... 63.245.215.25, 63.245.215.102 Connecting to hg.mozilla.org|63.245.215.25|:443... connected. WARNING: Certificate verification error for hg.mozilla.org: certificate signature failure HTTP request sent, awaiting response... 200 Script output follows Length: 12,179 (12K) [text/x-python] 0K .......... . 100% 2.27 GB/s 08:32:22 (2.27 GB/s) - `archiver_client.py' saved [12179/12179] program finished with exit code 0 elapsedTime=1.403000 ========= master_lag: 3.16 ========= ========= Finished 'bash -c ...' (results: 0, elapsed: 4 secs) (at 2016-12-22 08:32:25.047354) ========= ========= Started 'rm -rf ...' (results: 0, elapsed: 2 secs) (at 2016-12-22 08:32:25.047753) ========= 'rm' '-rf' 'scripts' 'properties' in dir C:\slave\test\. (timeout 1200 secs) watching logfiles {} argv: ['rm', '-rf', 'scripts', 'properties'] environment: ALLUSERSPROFILE=C:\ProgramData APPDATA=C:\Users\cltbld.T-W864-IX-303\AppData\Roaming COMMONPROGRAMFILES=C:\Program Files (x86)\Common Files COMMONPROGRAMFILES(X86)=C:\Program Files (x86)\Common Files COMMONPROGRAMW6432=C:\Program Files\Common Files COMPUTERNAME=T-W864-IX-303 COMSPEC=C:\windows\system32\cmd.exe DCLOCATION=SCL3 DNSSUFFIX=wintest.releng.scl3.mozilla.com FP_NO_HOST_CHECK=NO HOMEDRIVE=C: HOMEPATH=\Users\cltbld.T-W864-IX-303 KTS_HOME=C:\Program Files\KTS KTS_VERSION=1.19c LOCALAPPDATA=C:\Users\cltbld.T-W864-IX-303\AppData\Local LOGONSERVER=\\T-W864-IX-303 MONDIR=C:\Monitor_config\ MOZBUILDDIR=C:\mozilla-build\ NUMBER_OF_PROCESSORS=8 OS=Windows_NT OURDRIVE=C: PATH=C:\Program Files (x86)\NVIDIA Corporation\PhysX\Common;C:\windows\system32;C:\windows;C:\windows\System32\Wbem;C:\windows\System32\WindowsPowerShell\v1.0\;C:\mozilla-build\python27;C:\mozilla-build\python27\Scripts;C:\mozilla-build\msys\bin;C:\mozilla-build\vim\vim72;C:\mozilla-build\wget;C:\mozilla-build\info-zip;C:\CoreUtils\bin;C:\mozilla-build\buildbotve\scripts;C:\mozilla-build\hg PATHEXT=.COM;.EXE;.BAT;.CMD;.VBS;.VBE;.JS;.JSE;.WSF;.WSH;.MSC PROCESSOR_ARCHITECTURE=x86 PROCESSOR_ARCHITEW6432=AMD64 PROCESSOR_IDENTIFIER=Intel64 Family 6 Model 30 Stepping 5, GenuineIntel PROCESSOR_LEVEL=6 PROCESSOR_REVISION=1e05 PROGRAMDATA=C:\ProgramData PROGRAMFILES=C:\Program Files (x86) PROGRAMFILES(X86)=C:\Program Files (x86) PROGRAMW6432=C:\Program Files PROMPT=$P$G PSMODULEPATH=C:\windows\system32\WindowsPowerShell\v1.0\Modules\ PUBLIC=C:\Users\Public PWD=C:\slave\test RUNLOGFILE=C:\slave\\runslave.log SLAVEDIR=C:\slave\ SYSTEMDRIVE=C: SYSTEMROOT=C:\windows TEMP=C:\Users\CLTBLD~1.T-W\AppData\Local\Temp TEST1=testie TMP=C:\Users\CLTBLD~1.T-W\AppData\Local\Temp USERDOMAIN=T-W864-IX-303 USERDOMAIN_ROAMINGPROFILE=T-W864-IX-303 USERNAME=cltbld USERPROFILE=C:\Users\cltbld.T-W864-IX-303 WINDIR=C:\windows using PTY: False program finished with exit code 0 elapsedTime=2.707000 ========= master_lag: 0.03 ========= ========= Finished 'rm -rf ...' (results: 0, elapsed: 2 secs) (at 2016-12-22 08:32:27.784222) ========= ========= Started 'bash -c ...' (results: 0, elapsed: 4 secs) (at 2016-12-22 08:32:27.784637) ========= 'bash' '-c' u'python archiver_client.py mozharness --repo releases/mozilla-aurora --rev 2805e2b6c22f55a9155a9f55ede9caa53508bdff --destination scripts --debug' in dir C:\slave\test\. (timeout 1200 secs) watching logfiles {} argv: ['bash', '-c', u'python archiver_client.py mozharness --repo releases/mozilla-aurora --rev 2805e2b6c22f55a9155a9f55ede9caa53508bdff --destination scripts --debug'] environment: ALLUSERSPROFILE=C:\ProgramData APPDATA=C:\Users\cltbld.T-W864-IX-303\AppData\Roaming COMMONPROGRAMFILES=C:\Program Files (x86)\Common Files COMMONPROGRAMFILES(X86)=C:\Program Files (x86)\Common Files COMMONPROGRAMW6432=C:\Program Files\Common Files COMPUTERNAME=T-W864-IX-303 COMSPEC=C:\windows\system32\cmd.exe DCLOCATION=SCL3 DNSSUFFIX=wintest.releng.scl3.mozilla.com FP_NO_HOST_CHECK=NO HOMEDRIVE=C: HOMEPATH=\Users\cltbld.T-W864-IX-303 KTS_HOME=C:\Program Files\KTS KTS_VERSION=1.19c LOCALAPPDATA=C:\Users\cltbld.T-W864-IX-303\AppData\Local LOGONSERVER=\\T-W864-IX-303 MONDIR=C:\Monitor_config\ MOZBUILDDIR=C:\mozilla-build\ NUMBER_OF_PROCESSORS=8 OS=Windows_NT OURDRIVE=C: PATH=C:\Program Files (x86)\NVIDIA Corporation\PhysX\Common;C:\windows\system32;C:\windows;C:\windows\System32\Wbem;C:\windows\System32\WindowsPowerShell\v1.0\;C:\mozilla-build\python27;C:\mozilla-build\python27\Scripts;C:\mozilla-build\msys\bin;C:\mozilla-build\vim\vim72;C:\mozilla-build\wget;C:\mozilla-build\info-zip;C:\CoreUtils\bin;C:\mozilla-build\buildbotve\scripts;C:\mozilla-build\hg PATHEXT=.COM;.EXE;.BAT;.CMD;.VBS;.VBE;.JS;.JSE;.WSF;.WSH;.MSC PROCESSOR_ARCHITECTURE=x86 PROCESSOR_ARCHITEW6432=AMD64 PROCESSOR_IDENTIFIER=Intel64 Family 6 Model 30 Stepping 5, GenuineIntel PROCESSOR_LEVEL=6 PROCESSOR_REVISION=1e05 PROGRAMDATA=C:\ProgramData PROGRAMFILES=C:\Program Files (x86) PROGRAMFILES(X86)=C:\Program Files (x86) PROGRAMW6432=C:\Program Files PROMPT=$P$G PSMODULEPATH=C:\windows\system32\WindowsPowerShell\v1.0\Modules\ PUBLIC=C:\Users\Public PWD=C:\slave\test RUNLOGFILE=C:\slave\\runslave.log SLAVEDIR=C:\slave\ SYSTEMDRIVE=C: SYSTEMROOT=C:\windows TEMP=C:\Users\CLTBLD~1.T-W\AppData\Local\Temp TEST1=testie TMP=C:\Users\CLTBLD~1.T-W\AppData\Local\Temp USERDOMAIN=T-W864-IX-303 USERDOMAIN_ROAMINGPROFILE=T-W864-IX-303 USERNAME=cltbld USERPROFILE=C:\Users\cltbld.T-W864-IX-303 WINDIR=C:\windows using PTY: False 2016-12-22 08:32:28,546 truncating revision to first 12 chars 2016-12-22 08:32:28,546 Setting DEBUG logging. 2016-12-22 08:32:28,546 attempt 1/10 2016-12-22 08:32:28,546 Getting archive location from https://api.pub.build.mozilla.org/archiver/hgmo/releases/mozilla-aurora/2805e2b6c22f?&preferred_region=us-west-2&suffix=tar.gz&subdir=testing/mozharness 2016-12-22 08:32:29,394 unpacking tar archive at: mozilla-aurora-2805e2b6c22f/testing/mozharness/ 2016-12-22 08:32:29,684 skipping symlink on windows: configs/single_locale/linux32.py program finished with exit code 0 elapsedTime=1.629000 ========= master_lag: 2.83 ========= ========= Finished 'bash -c ...' (results: 0, elapsed: 4 secs) (at 2016-12-22 08:32:32.248068) ========= ========= Started set props: script_repo_revision (results: 0, elapsed: 0 secs) (at 2016-12-22 08:32:32.248443) ========= script_repo_revision: 2805e2b6c22f55a9155a9f55ede9caa53508bdff ========= Finished set props: script_repo_revision (results: 0, elapsed: 0 secs) (at 2016-12-22 08:32:32.248909) ========= ========= Started downloading to oauth.txt (results: 0, elapsed: 0 secs) (at 2016-12-22 08:32:32.249237) ========= ========= Finished downloading to oauth.txt (results: 0, elapsed: 0 secs) (at 2016-12-22 08:32:32.271891) ========= ========= Started 'c:/mozilla-build/python27/python -u ...' failed (results: 2, elapsed: 8 mins, 26 secs) (at 2016-12-22 08:32:32.272225) ========= 'c:/mozilla-build/python27/python' '-u' 'scripts/scripts/web_platform_tests.py' '--cfg' 'web_platform_tests/prod_config_windows.py' '--test-type=testharness' '--total-chunks' '10' '--this-chunk' '2' '--blob-upload-branch' 'mozilla-aurora' '--download-symbols' 'true' in dir C:\slave\test\. (timeout 1800 secs) (maxTime 7200 secs) watching logfiles {} argv: ['c:/mozilla-build/python27/python', '-u', 'scripts/scripts/web_platform_tests.py', '--cfg', 'web_platform_tests/prod_config_windows.py', '--test-type=testharness', '--total-chunks', '10', '--this-chunk', '2', '--blob-upload-branch', 'mozilla-aurora', '--download-symbols', 'true'] environment: ALLUSERSPROFILE=C:\ProgramData APPDATA=C:\Users\cltbld.T-W864-IX-303\AppData\Roaming COMMONPROGRAMFILES=C:\Program Files (x86)\Common Files COMMONPROGRAMFILES(X86)=C:\Program Files (x86)\Common Files COMMONPROGRAMW6432=C:\Program Files\Common Files COMPUTERNAME=T-W864-IX-303 COMSPEC=C:\windows\system32\cmd.exe DCLOCATION=SCL3 DNSSUFFIX=wintest.releng.scl3.mozilla.com FP_NO_HOST_CHECK=NO HOMEDRIVE=C: HOMEPATH=\Users\cltbld.T-W864-IX-303 KTS_HOME=C:\Program Files\KTS KTS_VERSION=1.19c LOCALAPPDATA=C:\Users\cltbld.T-W864-IX-303\AppData\Local LOGONSERVER=\\T-W864-IX-303 MONDIR=C:\Monitor_config\ MOZBUILDDIR=C:\mozilla-build\ MOZ_CRASHREPORTER_NO_REPORT=1 MOZ_HIDE_RESULTS_TABLE=1 MOZ_NO_REMOTE=1 NO_EM_RESTART=1 NO_FAIL_ON_TEST_ERRORS=1 NUMBER_OF_PROCESSORS=8 OS=Windows_NT OURDRIVE=C: PATH=C:\Program Files (x86)\NVIDIA Corporation\PhysX\Common;C:\windows\system32;C:\windows;C:\windows\System32\Wbem;C:\windows\System32\WindowsPowerShell\v1.0\;C:\mozilla-build\python27;C:\mozilla-build\python27\Scripts;C:\mozilla-build\msys\bin;C:\mozilla-build\vim\vim72;C:\mozilla-build\wget;C:\mozilla-build\info-zip;C:\CoreUtils\bin;C:\mozilla-build\buildbotve\scripts;C:\mozilla-build\hg PATHEXT=.COM;.EXE;.BAT;.CMD;.VBS;.VBE;.JS;.JSE;.WSF;.WSH;.MSC PROCESSOR_ARCHITECTURE=x86 PROCESSOR_ARCHITEW6432=AMD64 PROCESSOR_IDENTIFIER=Intel64 Family 6 Model 30 Stepping 5, GenuineIntel PROCESSOR_LEVEL=6 PROCESSOR_REVISION=1e05 PROGRAMDATA=C:\ProgramData PROGRAMFILES=C:\Program Files (x86) PROGRAMFILES(X86)=C:\Program Files (x86) PROGRAMW6432=C:\Program Files PROMPT=$P$G PROPERTIES_FILE=C:\slave\test/buildprops.json PSMODULEPATH=C:\windows\system32\WindowsPowerShell\v1.0\Modules\ PUBLIC=C:\Users\Public PWD=C:\slave\test RUNLOGFILE=C:\slave\\runslave.log SLAVEDIR=C:\slave\ SYSTEMDRIVE=C: SYSTEMROOT=C:\windows TEMP=C:\Users\CLTBLD~1.T-W\AppData\Local\Temp TEST1=testie TMP=C:\Users\CLTBLD~1.T-W\AppData\Local\Temp USERDOMAIN=T-W864-IX-303 USERDOMAIN_ROAMINGPROFILE=T-W864-IX-303 USERNAME=cltbld USERPROFILE=C:\Users\cltbld.T-W864-IX-303 WINDIR=C:\windows XPCOM_DEBUG_BREAK=warn using PTY: False 08:32:33 INFO - MultiFileLogger online at 20161222 08:32:33 in C:\slave\test 08:32:33 INFO - Run as scripts/scripts/web_platform_tests.py --cfg web_platform_tests/prod_config_windows.py --test-type=testharness --total-chunks 10 --this-chunk 2 --blob-upload-branch mozilla-aurora --download-symbols true 08:32:33 INFO - Dumping config to C:\slave\test\logs\localconfig.json. 08:32:33 INFO - {'allow_software_gl_layers': False, 08:32:33 INFO - 'append_to_log': False, 08:32:33 INFO - 'base_work_dir': 'C:\\slave\\test', 08:32:33 INFO - 'blob_upload_branch': 'mozilla-aurora', 08:32:33 INFO - 'blob_uploader_auth_file': 'C:\\slave\\test\\oauth.txt', 08:32:33 INFO - 'buildbot_json_path': 'buildprops.json', 08:32:33 INFO - 'config_files': ('web_platform_tests/prod_config_windows.py',), 08:32:33 INFO - 'default_blob_upload_servers': ('https://blobupload.elasticbeanstalk.com',), 08:32:33 INFO - 'download_minidump_stackwalk': True, 08:32:33 INFO - 'download_symbols': 'true', 08:32:33 INFO - 'e10s': False, 08:32:33 INFO - 'exes': {'hg': 'c:/mozilla-build/hg/hg', 08:32:33 INFO - 'mozinstall': ('C:\\slave\\test/build/venv/scripts/python', 08:32:33 INFO - 'C:\\slave\\test/build/venv/scripts/mozinstall-script.py'), 08:32:33 INFO - 'python': 'c:\\mozilla-build\\python27\\python.exe', 08:32:33 INFO - 'tooltool.py': ('c:\\mozilla-build\\python27\\python.exe', 08:32:33 INFO - 'C:/mozilla-build/tooltool.py'), 08:32:33 INFO - 'virtualenv': ('c:\\mozilla-build\\python27\\python.exe', 08:32:33 INFO - 'c:/mozilla-build/buildbotve/virtualenv.py')}, 08:32:33 INFO - 'find_links': ('http://pypi.pvt.build.mozilla.org/pub', 08:32:33 INFO - 'http://pypi.pub.build.mozilla.org/pub'), 08:32:33 INFO - 'log_level': 'info', 08:32:33 INFO - 'log_to_console': True, 08:32:33 INFO - 'opt_config_files': (), 08:32:33 INFO - 'options': ('--prefs-root=%(test_path)s/prefs', 08:32:33 INFO - '--processes=1', 08:32:33 INFO - '--config=%(test_path)s/wptrunner.ini', 08:32:33 INFO - '--ca-cert-path=%(test_path)s/certs/cacert.pem', 08:32:33 INFO - '--host-key-path=%(test_path)s/certs/web-platform.test.key', 08:32:33 INFO - '--host-cert-path=%(test_path)s/certs/web-platform.test.pem', 08:32:33 INFO - '--certutil-binary=%(test_install_path)s/bin/certutil'), 08:32:33 INFO - 'pip_index': False, 08:32:33 INFO - 'require_test_zip': True, 08:32:33 INFO - 'test_type': ('testharness',), 08:32:33 INFO - 'this_chunk': '2', 08:32:33 INFO - 'total_chunks': '10', 08:32:33 INFO - 'virtualenv_path': 'venv', 08:32:33 INFO - 'volatile_config': {'actions': None, 'add_actions': None, 'no_actions': None}, 08:32:33 INFO - 'work_dir': 'build'} 08:32:33 INFO - [mozharness: 2016-12-22 16:32:33.221000Z] Running clobber step. 08:32:33 INFO - Running pre-action listener: _resource_record_pre_action 08:32:33 INFO - Running main action method: clobber 08:32:33 INFO - rmtree: C:\slave\test\build 08:32:33 INFO - Using _rmtree_windows ... 08:32:33 INFO - retry: Calling _rmtree_windows with args: ('C:\\slave\\test\\build',), kwargs: {}, attempt #1 08:34:03 INFO - Running post-action listener: _resource_record_post_action 08:34:03 INFO - [mozharness: 2016-12-22 16:34:03.240000Z] Finished clobber step (success) 08:34:03 INFO - [mozharness: 2016-12-22 16:34:03.240000Z] Running read-buildbot-config step. 08:34:03 INFO - Running pre-action listener: _resource_record_pre_action 08:34:03 INFO - Running main action method: read_buildbot_config 08:34:03 INFO - Using buildbot properties: 08:34:03 INFO - { 08:34:03 INFO - "project": "", 08:34:03 INFO - "product": "firefox", 08:34:03 INFO - "script_repo_revision": "production", 08:34:03 INFO - "scheduler": "tests-mozilla-aurora-win8_64-debug-unittest", 08:34:03 INFO - "repository": "", 08:34:03 INFO - "buildername": "Windows 8 64-bit mozilla-aurora debug test web-platform-tests-2", 08:34:03 INFO - "buildid": "20161222065253", 08:34:03 INFO - "pgo_build": "False", 08:34:03 INFO - "basedir": "C:\\slave\\test", 08:34:03 INFO - "buildnumber": 4, 08:34:03 INFO - "slavename": "t-w864-ix-303", 08:34:03 INFO - "revision": "2805e2b6c22f55a9155a9f55ede9caa53508bdff", 08:34:03 INFO - "master": "http://buildbot-master126.bb.releng.scl3.mozilla.com:8201/", 08:34:03 INFO - "platform": "win64", 08:34:03 INFO - "branch": "mozilla-aurora", 08:34:03 INFO - "repo_path": "releases/mozilla-aurora", 08:34:03 INFO - "moz_repo_path": "", 08:34:03 INFO - "stage_platform": "win64", 08:34:03 INFO - "builduid": "312821edbfa04af3ab3dd3d065421b0c", 08:34:03 INFO - "slavebuilddir": "test" 08:34:03 INFO - } 08:34:03 INFO - Found a test packages url https://queue.taskcluster.net/v1/task/BGboJK_ERvKTPFUls4AHYA/artifacts/public/build/firefox-52.0a2.en-US.win64.test_packages.json. 08:34:03 INFO - Found installer url https://queue.taskcluster.net/v1/task/BGboJK_ERvKTPFUls4AHYA/artifacts/public/build/firefox-52.0a2.en-US.win64.zip. 08:34:03 INFO - Running post-action listener: _resource_record_post_action 08:34:03 INFO - [mozharness: 2016-12-22 16:34:03.243000Z] Finished read-buildbot-config step (success) 08:34:03 INFO - [mozharness: 2016-12-22 16:34:03.243000Z] Running download-and-extract step. 08:34:03 INFO - Running pre-action listener: _resource_record_pre_action 08:34:03 INFO - Running main action method: download_and_extract 08:34:03 INFO - mkdir: C:\slave\test\build\tests 08:34:03 INFO - proxxy config: {'regions': ['.use1.', '.usw2.', '.scl3'], 'instances': ['proxxy1.srv.releng.use1.mozilla.com', 'proxxy1.srv.releng.usw2.mozilla.com', 'proxxy1.srv.releng.scl3.mozilla.com'], 'urls': [('http://ftp.mozilla.org', 'ftp.mozilla.org'), ('https://ftp.mozilla.org', 'ftp.mozilla.org'), ('https://ftp-ssl.mozilla.org', 'ftp.mozilla.org'), ('http://pypi.pvt.build.mozilla.org', 'pypi.pvt.build.mozilla.org'), ('http://pypi.pub.build.mozilla.org', 'pypi.pub.build.mozilla.org')]} 08:34:03 INFO - trying https://queue.taskcluster.net/v1/task/BGboJK_ERvKTPFUls4AHYA/artifacts/public/build/firefox-52.0a2.en-US.win64.test_packages.json 08:34:03 INFO - Downloading https://queue.taskcluster.net/v1/task/BGboJK_ERvKTPFUls4AHYA/artifacts/public/build/firefox-52.0a2.en-US.win64.test_packages.json to C:\slave\test\build\firefox-52.0a2.en-US.win64.test_packages.json 08:34:03 INFO - retry: Calling _download_file with args: (), kwargs: {'url': 'https://queue.taskcluster.net/v1/task/BGboJK_ERvKTPFUls4AHYA/artifacts/public/build/firefox-52.0a2.en-US.win64.test_packages.json', 'file_name': 'C:\\slave\\test\\build\\firefox-52.0a2.en-US.win64.test_packages.json'}, attempt #1 08:34:03 INFO - Downloaded 1274 bytes. 08:34:03 INFO - Reading from file C:\slave\test\build\firefox-52.0a2.en-US.win64.test_packages.json 08:34:03 INFO - Using the following test package requirements: 08:34:03 INFO - {u'common': [u'firefox-52.0a2.en-US.win64.common.tests.zip'], 08:34:03 INFO - u'cppunittest': [u'firefox-52.0a2.en-US.win64.common.tests.zip', 08:34:03 INFO - u'firefox-52.0a2.en-US.win64.cppunittest.tests.zip'], 08:34:03 INFO - u'gtest': [u'firefox-52.0a2.en-US.win64.common.tests.zip', 08:34:03 INFO - u'firefox-52.0a2.en-US.win64.gtest.tests.zip'], 08:34:03 INFO - u'jittest': [u'firefox-52.0a2.en-US.win64.common.tests.zip', 08:34:03 INFO - u'jsshell-win64.zip'], 08:34:03 INFO - u'mochitest': [u'firefox-52.0a2.en-US.win64.common.tests.zip', 08:34:03 INFO - u'firefox-52.0a2.en-US.win64.mochitest.tests.zip'], 08:34:03 INFO - u'mozbase': [u'firefox-52.0a2.en-US.win64.common.tests.zip'], 08:34:03 INFO - u'reftest': [u'firefox-52.0a2.en-US.win64.common.tests.zip', 08:34:03 INFO - u'firefox-52.0a2.en-US.win64.reftest.tests.zip'], 08:34:03 INFO - u'talos': [u'firefox-52.0a2.en-US.win64.common.tests.zip', 08:34:03 INFO - u'firefox-52.0a2.en-US.win64.talos.tests.zip'], 08:34:03 INFO - u'web-platform': [u'firefox-52.0a2.en-US.win64.common.tests.zip', 08:34:03 INFO - u'firefox-52.0a2.en-US.win64.web-platform.tests.zip'], 08:34:03 INFO - u'xpcshell': [u'firefox-52.0a2.en-US.win64.common.tests.zip', 08:34:03 INFO - u'firefox-52.0a2.en-US.win64.xpcshell.tests.zip']} 08:34:03 INFO - Downloading packages: [u'firefox-52.0a2.en-US.win64.common.tests.zip', u'firefox-52.0a2.en-US.win64.web-platform.tests.zip'] for test suite category: web-platform 08:34:03 INFO - Downloading and extracting to C:\slave\test\build\tests these dirs bin/*, config/*, mozbase/*, marionette/*, tools/wptserve/*, web-platform/* from https://queue.taskcluster.net/v1/task/BGboJK_ERvKTPFUls4AHYA/artifacts/public/build/firefox-52.0a2.en-US.win64.common.tests.zip 08:34:03 INFO - retry: Calling fetch_url_into_memory with args: (), kwargs: {'url': u'https://queue.taskcluster.net/v1/task/BGboJK_ERvKTPFUls4AHYA/artifacts/public/build/firefox-52.0a2.en-US.win64.common.tests.zip'}, attempt #1 08:34:03 INFO - Fetch https://queue.taskcluster.net/v1/task/BGboJK_ERvKTPFUls4AHYA/artifacts/public/build/firefox-52.0a2.en-US.win64.common.tests.zip into memory 08:34:04 INFO - Http code: 200 08:34:04 INFO - via: 1.1 37af14ee951b12568cf1cc160d08abe6.cloudfront.net (CloudFront) 08:34:04 INFO - x-amz-cf-id: ib2rgVB_QpL-aHREE92POAuwxQxeK_tzSd20iiLgza6hgPMyRB1C8g== 08:34:04 INFO - x-amz-version-id: _uF2ShparQDmMuwJeog6Yf0kP0efjM_E 08:34:05 INFO - Expected file size: 19501721 08:34:05 INFO - Obtained file size: 19501721 08:34:06 INFO - Downloading and extracting to C:\slave\test\build\tests these dirs bin/*, config/*, mozbase/*, marionette/*, tools/wptserve/*, web-platform/* from https://queue.taskcluster.net/v1/task/BGboJK_ERvKTPFUls4AHYA/artifacts/public/build/firefox-52.0a2.en-US.win64.web-platform.tests.zip 08:34:06 INFO - retry: Calling fetch_url_into_memory with args: (), kwargs: {'url': u'https://queue.taskcluster.net/v1/task/BGboJK_ERvKTPFUls4AHYA/artifacts/public/build/firefox-52.0a2.en-US.win64.web-platform.tests.zip'}, attempt #1 08:34:06 INFO - Fetch https://queue.taskcluster.net/v1/task/BGboJK_ERvKTPFUls4AHYA/artifacts/public/build/firefox-52.0a2.en-US.win64.web-platform.tests.zip into memory 08:34:06 INFO - Http code: 200 08:34:06 INFO - via: 1.1 4c2196e36fd33f377384d605b4424e95.cloudfront.net (CloudFront) 08:34:06 INFO - x-amz-cf-id: z1a25qYcLXbQ6A5T-LK2lyDBAtkqTq04SYwXrNHWyb6DFWv3CRO3Qw== 08:34:06 INFO - x-amz-version-id: mzZyGH7FNXjUDLT8R09jHUi5329oznPU 08:34:10 INFO - Expected file size: 43226659 08:34:10 INFO - Obtained file size: 43226659 08:34:45 INFO - proxxy config: {'regions': ['.use1.', '.usw2.', '.scl3'], 'instances': ['proxxy1.srv.releng.use1.mozilla.com', 'proxxy1.srv.releng.usw2.mozilla.com', 'proxxy1.srv.releng.scl3.mozilla.com'], 'urls': [('http://ftp.mozilla.org', 'ftp.mozilla.org'), ('https://ftp.mozilla.org', 'ftp.mozilla.org'), ('https://ftp-ssl.mozilla.org', 'ftp.mozilla.org'), ('http://pypi.pvt.build.mozilla.org', 'pypi.pvt.build.mozilla.org'), ('http://pypi.pub.build.mozilla.org', 'pypi.pub.build.mozilla.org')]} 08:34:45 INFO - trying https://queue.taskcluster.net/v1/task/BGboJK_ERvKTPFUls4AHYA/artifacts/public/build/firefox-52.0a2.en-US.win64.zip 08:34:45 INFO - Downloading https://queue.taskcluster.net/v1/task/BGboJK_ERvKTPFUls4AHYA/artifacts/public/build/firefox-52.0a2.en-US.win64.zip to C:\slave\test\build\firefox-52.0a2.en-US.win64.zip 08:34:45 INFO - retry: Calling _download_file with args: (), kwargs: {'url': 'https://queue.taskcluster.net/v1/task/BGboJK_ERvKTPFUls4AHYA/artifacts/public/build/firefox-52.0a2.en-US.win64.zip', 'file_name': 'C:\\slave\\test\\build\\firefox-52.0a2.en-US.win64.zip'}, attempt #1 08:34:47 INFO - Downloaded 80299959 bytes. 08:34:47 INFO - Setting buildbot property build_url to https://queue.taskcluster.net/v1/task/BGboJK_ERvKTPFUls4AHYA/artifacts/public/build/firefox-52.0a2.en-US.win64.zip 08:34:47 INFO - mkdir: C:\slave\test\properties 08:34:47 INFO - Writing buildbot properties ['build_url'] to C:\slave\test\properties\build_url 08:34:47 INFO - Writing to file C:\slave\test\properties\build_url 08:34:47 INFO - Contents: 08:34:47 INFO - build_url:https://queue.taskcluster.net/v1/task/BGboJK_ERvKTPFUls4AHYA/artifacts/public/build/firefox-52.0a2.en-US.win64.zip 08:34:47 INFO - retry: Calling query_symbols_url with args: (), kwargs: {}, attempt #1 08:34:48 INFO - Setting buildbot property symbols_url to https://queue.taskcluster.net/v1/task/BGboJK_ERvKTPFUls4AHYA/artifacts/public/build/firefox-52.0a2.en-US.win64.crashreporter-symbols.zip 08:34:48 INFO - Writing buildbot properties ['symbols_url'] to C:\slave\test\properties\symbols_url 08:34:48 INFO - Writing to file C:\slave\test\properties\symbols_url 08:34:48 INFO - Contents: 08:34:48 INFO - symbols_url:https://queue.taskcluster.net/v1/task/BGboJK_ERvKTPFUls4AHYA/artifacts/public/build/firefox-52.0a2.en-US.win64.crashreporter-symbols.zip 08:34:48 INFO - Downloading and extracting to C:\slave\test\build\symbols these dirs * from https://queue.taskcluster.net/v1/task/BGboJK_ERvKTPFUls4AHYA/artifacts/public/build/firefox-52.0a2.en-US.win64.crashreporter-symbols.zip 08:34:48 INFO - retry: Calling fetch_url_into_memory with args: (), kwargs: {'url': 'https://queue.taskcluster.net/v1/task/BGboJK_ERvKTPFUls4AHYA/artifacts/public/build/firefox-52.0a2.en-US.win64.crashreporter-symbols.zip'}, attempt #1 08:34:48 INFO - Fetch https://queue.taskcluster.net/v1/task/BGboJK_ERvKTPFUls4AHYA/artifacts/public/build/firefox-52.0a2.en-US.win64.crashreporter-symbols.zip into memory 08:34:49 INFO - Http code: 200 08:34:49 INFO - via: 1.1 6cd88b9fd84ad5daa3b3867fb8c5c91a.cloudfront.net (CloudFront) 08:34:49 INFO - x-amz-cf-id: ILYQxL2HZs4x0tTANdgXffOt7dbR19KePPD2bGfK5PXFVUuC-X78dg== 08:34:49 INFO - x-amz-version-id: WjwWKRSmrYtt7Z25tKpYn74JDF4c152r 08:34:49 INFO - Expected file size: 54692143 08:34:49 INFO - Obtained file size: 54692143 08:34:55 INFO - Running post-action listener: _resource_record_post_action 08:34:55 INFO - Running post-action listener: set_extra_try_arguments 08:34:55 INFO - [mozharness: 2016-12-22 16:34:55.096000Z] Finished download-and-extract step (success) 08:34:55 INFO - [mozharness: 2016-12-22 16:34:55.096000Z] Running fetch-geckodriver step. 08:34:55 INFO - Running pre-action listener: _resource_record_pre_action 08:34:55 INFO - Running main action method: fetch_geckodriver 08:34:55 INFO - Running post-action listener: _resource_record_post_action 08:34:55 INFO - [mozharness: 2016-12-22 16:34:55.097000Z] Finished fetch-geckodriver step (success) 08:34:55 INFO - [mozharness: 2016-12-22 16:34:55.097000Z] Running create-virtualenv step. 08:34:55 INFO - Running pre-action listener: _pre_create_virtualenv 08:34:55 INFO - Running pre-action listener: _resource_record_pre_action 08:34:55 INFO - Running main action method: create_virtualenv 08:34:55 INFO - Creating virtualenv C:\slave\test\build\venv 08:34:55 INFO - Running command: ['c:\\mozilla-build\\python27\\python.exe', 'c:/mozilla-build/buildbotve/virtualenv.py', '--no-site-packages', '--distribute', 'C:\\slave\\test\\build\\venv'] in C:\slave\test\build 08:34:55 INFO - Copy/paste: c:\mozilla-build\python27\python.exe c:/mozilla-build/buildbotve/virtualenv.py --no-site-packages --distribute C:\slave\test\build\venv 08:34:58 INFO - New python executable in C:\slave\test\build\venv\Scripts\python.exe 08:35:03 INFO - Installing distribute......................................................................................................................................................................................done. 08:35:04 INFO - Return code: 0 08:35:04 INFO - Getting output from command: ['C:\\slave\\test\\build\\venv\\Scripts\\pip', '--version'] 08:35:04 INFO - Copy/paste: C:\slave\test\build\venv\Scripts\pip --version 08:35:05 INFO - Reading from file tmpfile_stdout 08:35:05 INFO - Output received: 08:35:05 INFO - pip 0.8.2 from c:\slave\test\build\venv\lib\site-packages\pip-0.8.2-py2.7.egg (python 2.7) 08:35:05 INFO - Using _rmtree_windows ... 08:35:05 INFO - Using _rmtree_windows ... 08:35:05 INFO - Installing psutil>=3.1.1 into virtualenv C:\slave\test\build\venv 08:35:05 INFO - proxxy config: {'regions': ['.use1.', '.usw2.', '.scl3'], 'instances': ['proxxy1.srv.releng.use1.mozilla.com', 'proxxy1.srv.releng.usw2.mozilla.com', 'proxxy1.srv.releng.scl3.mozilla.com'], 'urls': [('http://ftp.mozilla.org', 'ftp.mozilla.org'), ('https://ftp.mozilla.org', 'ftp.mozilla.org'), ('https://ftp-ssl.mozilla.org', 'ftp.mozilla.org'), ('http://pypi.pvt.build.mozilla.org', 'pypi.pvt.build.mozilla.org'), ('http://pypi.pub.build.mozilla.org', 'pypi.pub.build.mozilla.org')]} 08:35:05 INFO - http://pypi.pvt.build.mozilla.org/pub matches http://pypi.pvt.build.mozilla.org 08:35:05 INFO - proxxy config: {'regions': ['.use1.', '.usw2.', '.scl3'], 'instances': ['proxxy1.srv.releng.use1.mozilla.com', 'proxxy1.srv.releng.usw2.mozilla.com', 'proxxy1.srv.releng.scl3.mozilla.com'], 'urls': [('http://ftp.mozilla.org', 'ftp.mozilla.org'), ('https://ftp.mozilla.org', 'ftp.mozilla.org'), ('https://ftp-ssl.mozilla.org', 'ftp.mozilla.org'), ('http://pypi.pvt.build.mozilla.org', 'pypi.pvt.build.mozilla.org'), ('http://pypi.pub.build.mozilla.org', 'pypi.pub.build.mozilla.org')]} 08:35:05 INFO - http://pypi.pub.build.mozilla.org/pub matches http://pypi.pub.build.mozilla.org 08:35:05 INFO - retry: Calling run_command with args: [['C:\\slave\\test\\build\\venv\\Scripts\\pip', 'install', '--timeout', '120', '--no-index', '--find-links', 'http://pypi.pvt.build.mozilla.org/pub', '--find-links', 'http://pypi.pub.build.mozilla.org/pub', 'psutil>=3.1.1']], kwargs: {'error_level': 'warning', 'error_list': [{'substr': 'not found or a compiler error:', 'level': 'warning'}, {'regex': <_sre.SRE_Pattern object at 0x026CB250>, 'level': 'error'}, {'regex': <_sre.SRE_Pattern object at 0x026E0188>, 'level': 'warning'}, {'regex': <_sre.SRE_Pattern object at 0x02630048>, 'level': 'debug'}, {'substr': 'command not found', 'level': 'error'}, {'regex': <_sre.SRE_Pattern object at 0x01E18DE8>, 'level': 'warning'}, {'substr': 'Traceback (most recent call last)', 'level': 'error'}, {'substr': 'SyntaxError: ', 'level': 'error'}, {'substr': 'TypeError: ', 'level': 'error'}, {'substr': 'NameError: ', 'level': 'error'}, {'substr': 'ZeroDivisionError: ', 'level': 'error'}, {'regex': <_sre.SRE_Pattern object at 0x02604230>, 'level': 'critical'}, {'regex': <_sre.SRE_Pattern object at 0x026D4520>, 'level': 'critical'}], 'cwd': 'C:\\slave\\test\\build', 'env': {'TMP': 'C:\\Users\\CLTBLD~1.T-W\\AppData\\Local\\Temp', 'TEST1': 'testie', 'COMPUTERNAME': 'T-W864-IX-303', 'USERDOMAIN': 'T-W864-IX-303', 'KTS_VERSION': '1.19c', 'PSMODULEPATH': 'C:\\windows\\system32\\WindowsPowerShell\\v1.0\\Modules\\', 'COMMONPROGRAMFILES': 'C:\\Program Files (x86)\\Common Files', 'PROCESSOR_IDENTIFIER': 'Intel64 Family 6 Model 30 Stepping 5, GenuineIntel', 'PROGRAMFILES': 'C:\\Program Files (x86)', 'PROCESSOR_REVISION': '1e05', 'DNSSUFFIX': 'wintest.releng.scl3.mozilla.com', 'SYSTEMROOT': 'C:\\windows', 'NO_EM_RESTART': '1', 'PROGRAMFILES(X86)': 'C:\\Program Files (x86)', 'OURDRIVE': 'C:', 'MOZ_HIDE_RESULTS_TABLE': '1', 'XPCOM_DEBUG_BREAK': 'warn', 'MONDIR': 'C:\\Monitor_config\\', 'TEMP': 'C:\\Users\\CLTBLD~1.T-W\\AppData\\Local\\Temp', 'COMMONPROGRAMFILES(X86)': 'C:\\Program Files (x86)\\Common Files', 'RUNLOGFILE': 'C:\\slave\\\\runslave.log', 'PROCESSOR_ARCHITECTURE': 'x86', 'ALLUSERSPROFILE': 'C:\\ProgramData', 'USERPROFILE': 'C:\\Users\\cltbld.T-W864-IX-303', 'LOCALAPPDATA': 'C:\\Users\\cltbld.T-W864-IX-303\\AppData\\Local', 'HOMEPATH': '\\Users\\cltbld.T-W864-IX-303', 'USERDOMAIN_ROAMINGPROFILE': 'T-W864-IX-303', 'MOZBUILDDIR': 'C:\\mozilla-build\\', 'PROGRAMW6432': 'C:\\Program Files', 'USERNAME': 'cltbld', 'LOGONSERVER': '\\\\T-W864-IX-303', 'MOZ_NO_REMOTE': '1', 'COMSPEC': 'C:\\windows\\system32\\cmd.exe', 'PROGRAMDATA': 'C:\\ProgramData', 'PROPERTIES_FILE': 'C:\\slave\\test/buildprops.json', 'PATH': 'C:\\Program Files (x86)\\NVIDIA Corporation\\PhysX\\Common;C:\\windows\\system32;C:\\windows;C:\\windows\\System32\\Wbem;C:\\windows\\System32\\WindowsPowerShell\\v1.0\\;C:\\mozilla-build\\python27;C:\\mozilla-build\\python27\\Scripts;C:\\mozilla-build\\msys\\bin;C:\\mozilla-build\\vim\\vim72;C:\\mozilla-build\\wget;C:\\mozilla-build\\info-zip;C:\\CoreUtils\\bin;C:\\mozilla-build\\buildbotve\\scripts;C:\\mozilla-build\\hg', 'PROMPT': '$P$G', 'NO_FAIL_ON_TEST_ERRORS': '1', 'PATHEXT': '.COM;.EXE;.BAT;.CMD;.VBS;.VBE;.JS;.JSE;.WSF;.WSH;.MSC', 'FP_NO_HOST_CHECK': 'NO', 'DCLOCATION': 'SCL3', 'APPDATA': 'C:\\Users\\cltbld.T-W864-IX-303\\AppData\\Roaming', 'HOMEDRIVE': 'C:', 'SYSTEMDRIVE': 'C:', 'SLAVEDIR': 'C:\\slave\\', 'NUMBER_OF_PROCESSORS': '8', 'PWD': 'C:\\slave\\test', 'PROCESSOR_LEVEL': '6', 'KTS_HOME': 'C:\\Program Files\\KTS', 'PROCESSOR_ARCHITEW6432': 'AMD64', 'MOZ_CRASHREPORTER_NO_REPORT': '1', 'COMMONPROGRAMW6432': 'C:\\Program Files\\Common Files', 'OS': 'Windows_NT', 'PUBLIC': 'C:\\Users\\Public', 'WINDIR': 'C:\\windows'}}, attempt #1 08:35:05 INFO - Running command: ['C:\\slave\\test\\build\\venv\\Scripts\\pip', 'install', '--timeout', '120', '--no-index', '--find-links', 'http://pypi.pvt.build.mozilla.org/pub', '--find-links', 'http://pypi.pub.build.mozilla.org/pub', 'psutil>=3.1.1'] in C:\slave\test\build 08:35:05 INFO - Copy/paste: C:\slave\test\build\venv\Scripts\pip install --timeout 120 --no-index --find-links http://pypi.pvt.build.mozilla.org/pub --find-links http://pypi.pub.build.mozilla.org/pub psutil>=3.1.1 08:35:05 INFO - Using env: {'ALLUSERSPROFILE': 'C:\\ProgramData', 08:35:05 INFO - 'APPDATA': 'C:\\Users\\cltbld.T-W864-IX-303\\AppData\\Roaming', 08:35:05 INFO - 'COMMONPROGRAMFILES': 'C:\\Program Files (x86)\\Common Files', 08:35:05 INFO - 'COMMONPROGRAMFILES(X86)': 'C:\\Program Files (x86)\\Common Files', 08:35:05 INFO - 'COMMONPROGRAMW6432': 'C:\\Program Files\\Common Files', 08:35:05 INFO - 'COMPUTERNAME': 'T-W864-IX-303', 08:35:05 INFO - 'COMSPEC': 'C:\\windows\\system32\\cmd.exe', 08:35:05 INFO - 'DCLOCATION': 'SCL3', 08:35:05 INFO - 'DNSSUFFIX': 'wintest.releng.scl3.mozilla.com', 08:35:05 INFO - 'FP_NO_HOST_CHECK': 'NO', 08:35:05 INFO - 'HOMEDRIVE': 'C:', 08:35:05 INFO - 'HOMEPATH': '\\Users\\cltbld.T-W864-IX-303', 08:35:05 INFO - 'KTS_HOME': 'C:\\Program Files\\KTS', 08:35:05 INFO - 'KTS_VERSION': '1.19c', 08:35:05 INFO - 'LOCALAPPDATA': 'C:\\Users\\cltbld.T-W864-IX-303\\AppData\\Local', 08:35:05 INFO - 'LOGONSERVER': '\\\\T-W864-IX-303', 08:35:05 INFO - 'MONDIR': 'C:\\Monitor_config\\', 08:35:05 INFO - 'MOZBUILDDIR': 'C:\\mozilla-build\\', 08:35:05 INFO - 'MOZ_CRASHREPORTER_NO_REPORT': '1', 08:35:05 INFO - 'MOZ_HIDE_RESULTS_TABLE': '1', 08:35:05 INFO - 'MOZ_NO_REMOTE': '1', 08:35:05 INFO - 'NO_EM_RESTART': '1', 08:35:05 INFO - 'NO_FAIL_ON_TEST_ERRORS': '1', 08:35:05 INFO - 'NUMBER_OF_PROCESSORS': '8', 08:35:05 INFO - 'OS': 'Windows_NT', 08:35:05 INFO - 'OURDRIVE': 'C:', 08:35:05 INFO - 'PATH': 'C:\\Program Files (x86)\\NVIDIA Corporation\\PhysX\\Common;C:\\windows\\system32;C:\\windows;C:\\windows\\System32\\Wbem;C:\\windows\\System32\\WindowsPowerShell\\v1.0\\;C:\\mozilla-build\\python27;C:\\mozilla-build\\python27\\Scripts;C:\\mozilla-build\\msys\\bin;C:\\mozilla-build\\vim\\vim72;C:\\mozilla-build\\wget;C:\\mozilla-build\\info-zip;C:\\CoreUtils\\bin;C:\\mozilla-build\\buildbotve\\scripts;C:\\mozilla-build\\hg', 08:35:05 INFO - 'PATHEXT': '.COM;.EXE;.BAT;.CMD;.VBS;.VBE;.JS;.JSE;.WSF;.WSH;.MSC', 08:35:05 INFO - 'PROCESSOR_ARCHITECTURE': 'x86', 08:35:05 INFO - 'PROCESSOR_ARCHITEW6432': 'AMD64', 08:35:05 INFO - 'PROCESSOR_IDENTIFIER': 'Intel64 Family 6 Model 30 Stepping 5, GenuineIntel', 08:35:05 INFO - 'PROCESSOR_LEVEL': '6', 08:35:05 INFO - 'PROCESSOR_REVISION': '1e05', 08:35:05 INFO - 'PROGRAMDATA': 'C:\\ProgramData', 08:35:05 INFO - 'PROGRAMFILES': 'C:\\Program Files (x86)', 08:35:05 INFO - 'PROGRAMFILES(X86)': 'C:\\Program Files (x86)', 08:35:05 INFO - 'PROGRAMW6432': 'C:\\Program Files', 08:35:05 INFO - 'PROMPT': '$P$G', 08:35:05 INFO - 'PROPERTIES_FILE': 'C:\\slave\\test/buildprops.json', 08:35:05 INFO - 'PSMODULEPATH': 'C:\\windows\\system32\\WindowsPowerShell\\v1.0\\Modules\\', 08:35:05 INFO - 'PUBLIC': 'C:\\Users\\Public', 08:35:05 INFO - 'PWD': 'C:\\slave\\test', 08:35:05 INFO - 'RUNLOGFILE': 'C:\\slave\\\\runslave.log', 08:35:05 INFO - 'SLAVEDIR': 'C:\\slave\\', 08:35:05 INFO - 'SYSTEMDRIVE': 'C:', 08:35:05 INFO - 'SYSTEMROOT': 'C:\\windows', 08:35:05 INFO - 'TEMP': 'C:\\Users\\CLTBLD~1.T-W\\AppData\\Local\\Temp', 08:35:05 INFO - 'TEST1': 'testie', 08:35:05 INFO - 'TMP': 'C:\\Users\\CLTBLD~1.T-W\\AppData\\Local\\Temp', 08:35:05 INFO - 'USERDOMAIN': 'T-W864-IX-303', 08:35:05 INFO - 'USERDOMAIN_ROAMINGPROFILE': 'T-W864-IX-303', 08:35:05 INFO - 'USERNAME': 'cltbld', 08:35:05 INFO - 'USERPROFILE': 'C:\\Users\\cltbld.T-W864-IX-303', 08:35:05 INFO - 'WINDIR': 'C:\\windows', 08:35:05 INFO - 'XPCOM_DEBUG_BREAK': 'warn'} 08:35:05 INFO - Ignoring indexes: http://pypi.python.org/simple/ 08:35:05 INFO - Downloading/unpacking psutil>=3.1.1 08:35:06 INFO - Running setup.py egg_info for package psutil 08:35:06 INFO - warning: no previously-included files matching '*' found under directory 'docs\_build' 08:35:06 INFO - warning: manifest_maker: MANIFEST.in, line 18: 'recursive-include' expects ... 08:35:06 INFO - Installing collected packages: psutil 08:35:06 INFO - Running setup.py install for psutil 08:35:06 INFO - building 'psutil._psutil_windows' extension 08:35:06 INFO - error: Unable to find vcvarsall.bat 08:35:06 INFO - Complete output from command C:\slave\test\build\venv\Scripts\python.exe -c "import setuptools;__file__='C:\\slave\\test\\build\\venv\\build\\psutil\\setup.py';execfile(__file__)" install --single-version-externally-managed --record c:\users\cltbld~1.t-w\appdata\local\temp\pip-n4zdve-record\install-record.txt --install-headers C:\slave\test\build\venv\include\site\python2.7: 08:35:06 INFO - running install 08:35:06 INFO - running build 08:35:06 INFO - running build_py 08:35:06 INFO - creating build 08:35:06 INFO - creating build\lib.win32-2.7 08:35:06 INFO - creating build\lib.win32-2.7\psutil 08:35:06 INFO - copying psutil\_common.py -> build\lib.win32-2.7\psutil 08:35:06 INFO - copying psutil\_compat.py -> build\lib.win32-2.7\psutil 08:35:06 INFO - copying psutil\_psbsd.py -> build\lib.win32-2.7\psutil 08:35:06 INFO - copying psutil\_pslinux.py -> build\lib.win32-2.7\psutil 08:35:06 INFO - copying psutil\_psosx.py -> build\lib.win32-2.7\psutil 08:35:06 INFO - copying psutil\_psposix.py -> build\lib.win32-2.7\psutil 08:35:06 INFO - copying psutil\_pssunos.py -> build\lib.win32-2.7\psutil 08:35:06 INFO - copying psutil\_pswindows.py -> build\lib.win32-2.7\psutil 08:35:06 INFO - copying psutil\__init__.py -> build\lib.win32-2.7\psutil 08:35:06 INFO - running build_ext 08:35:06 INFO - building 'psutil._psutil_windows' extension 08:35:06 INFO - error: Unable to find vcvarsall.bat 08:35:06 INFO - ---------------------------------------- 08:35:06 INFO - Command C:\slave\test\build\venv\Scripts\python.exe -c "import setuptools;__file__='C:\\slave\\test\\build\\venv\\build\\psutil\\setup.py';execfile(__file__)" install --single-version-externally-managed --record c:\users\cltbld~1.t-w\appdata\local\temp\pip-n4zdve-record\install-record.txt --install-headers C:\slave\test\build\venv\include\site\python2.7 failed with error code 1 08:35:06 INFO - Storing complete log in C:\Users\cltbld.T-W864-IX-303\AppData\Roaming\pip\pip.log 08:35:06 WARNING - Return code: 1 08:35:06 WARNING - Could not install python package: C:\slave\test\build\venv\Scripts\pip install --timeout 120 --no-index --find-links http://pypi.pvt.build.mozilla.org/pub --find-links http://pypi.pub.build.mozilla.org/pub psutil>=3.1.1 failed after 1 tries! 08:35:06 INFO - Installing mozsystemmonitor==0.3 into virtualenv C:\slave\test\build\venv 08:35:06 INFO - proxxy config: {'regions': ['.use1.', '.usw2.', '.scl3'], 'instances': ['proxxy1.srv.releng.use1.mozilla.com', 'proxxy1.srv.releng.usw2.mozilla.com', 'proxxy1.srv.releng.scl3.mozilla.com'], 'urls': [('http://ftp.mozilla.org', 'ftp.mozilla.org'), ('https://ftp.mozilla.org', 'ftp.mozilla.org'), ('https://ftp-ssl.mozilla.org', 'ftp.mozilla.org'), ('http://pypi.pvt.build.mozilla.org', 'pypi.pvt.build.mozilla.org'), ('http://pypi.pub.build.mozilla.org', 'pypi.pub.build.mozilla.org')]} 08:35:06 INFO - http://pypi.pvt.build.mozilla.org/pub matches http://pypi.pvt.build.mozilla.org 08:35:06 INFO - proxxy config: {'regions': ['.use1.', '.usw2.', '.scl3'], 'instances': ['proxxy1.srv.releng.use1.mozilla.com', 'proxxy1.srv.releng.usw2.mozilla.com', 'proxxy1.srv.releng.scl3.mozilla.com'], 'urls': [('http://ftp.mozilla.org', 'ftp.mozilla.org'), ('https://ftp.mozilla.org', 'ftp.mozilla.org'), ('https://ftp-ssl.mozilla.org', 'ftp.mozilla.org'), ('http://pypi.pvt.build.mozilla.org', 'pypi.pvt.build.mozilla.org'), ('http://pypi.pub.build.mozilla.org', 'pypi.pub.build.mozilla.org')]} 08:35:06 INFO - http://pypi.pub.build.mozilla.org/pub matches http://pypi.pub.build.mozilla.org 08:35:06 INFO - retry: Calling run_command with args: [['C:\\slave\\test\\build\\venv\\Scripts\\pip', 'install', '--timeout', '120', '--no-index', '--find-links', 'http://pypi.pvt.build.mozilla.org/pub', '--find-links', 'http://pypi.pub.build.mozilla.org/pub', 'mozsystemmonitor==0.3']], kwargs: {'error_level': 'warning', 'error_list': [{'substr': 'not found or a compiler error:', 'level': 'warning'}, {'regex': <_sre.SRE_Pattern object at 0x026CB250>, 'level': 'error'}, {'regex': <_sre.SRE_Pattern object at 0x026E0188>, 'level': 'warning'}, {'regex': <_sre.SRE_Pattern object at 0x02630048>, 'level': 'debug'}, {'substr': 'command not found', 'level': 'error'}, {'regex': <_sre.SRE_Pattern object at 0x01E18DE8>, 'level': 'warning'}, {'substr': 'Traceback (most recent call last)', 'level': 'error'}, {'substr': 'SyntaxError: ', 'level': 'error'}, {'substr': 'TypeError: ', 'level': 'error'}, {'substr': 'NameError: ', 'level': 'error'}, {'substr': 'ZeroDivisionError: ', 'level': 'error'}, {'regex': <_sre.SRE_Pattern object at 0x02604230>, 'level': 'critical'}, {'regex': <_sre.SRE_Pattern object at 0x026D4520>, 'level': 'critical'}], 'cwd': 'C:\\slave\\test\\build', 'env': {'TMP': 'C:\\Users\\CLTBLD~1.T-W\\AppData\\Local\\Temp', 'TEST1': 'testie', 'COMPUTERNAME': 'T-W864-IX-303', 'USERDOMAIN': 'T-W864-IX-303', 'KTS_VERSION': '1.19c', 'PSMODULEPATH': 'C:\\windows\\system32\\WindowsPowerShell\\v1.0\\Modules\\', 'COMMONPROGRAMFILES': 'C:\\Program Files (x86)\\Common Files', 'PROCESSOR_IDENTIFIER': 'Intel64 Family 6 Model 30 Stepping 5, GenuineIntel', 'PROGRAMFILES': 'C:\\Program Files (x86)', 'PROCESSOR_REVISION': '1e05', 'DNSSUFFIX': 'wintest.releng.scl3.mozilla.com', 'SYSTEMROOT': 'C:\\windows', 'NO_EM_RESTART': '1', 'PROGRAMFILES(X86)': 'C:\\Program Files (x86)', 'OURDRIVE': 'C:', 'MOZ_HIDE_RESULTS_TABLE': '1', 'XPCOM_DEBUG_BREAK': 'warn', 'MONDIR': 'C:\\Monitor_config\\', 'TEMP': 'C:\\Users\\CLTBLD~1.T-W\\AppData\\Local\\Temp', 'COMMONPROGRAMFILES(X86)': 'C:\\Program Files (x86)\\Common Files', 'RUNLOGFILE': 'C:\\slave\\\\runslave.log', 'PROCESSOR_ARCHITECTURE': 'x86', 'ALLUSERSPROFILE': 'C:\\ProgramData', 'USERPROFILE': 'C:\\Users\\cltbld.T-W864-IX-303', 'LOCALAPPDATA': 'C:\\Users\\cltbld.T-W864-IX-303\\AppData\\Local', 'HOMEPATH': '\\Users\\cltbld.T-W864-IX-303', 'USERDOMAIN_ROAMINGPROFILE': 'T-W864-IX-303', 'MOZBUILDDIR': 'C:\\mozilla-build\\', 'PROGRAMW6432': 'C:\\Program Files', 'USERNAME': 'cltbld', 'LOGONSERVER': '\\\\T-W864-IX-303', 'MOZ_NO_REMOTE': '1', 'COMSPEC': 'C:\\windows\\system32\\cmd.exe', 'PROGRAMDATA': 'C:\\ProgramData', 'PROPERTIES_FILE': 'C:\\slave\\test/buildprops.json', 'PATH': 'C:\\Program Files (x86)\\NVIDIA Corporation\\PhysX\\Common;C:\\windows\\system32;C:\\windows;C:\\windows\\System32\\Wbem;C:\\windows\\System32\\WindowsPowerShell\\v1.0\\;C:\\mozilla-build\\python27;C:\\mozilla-build\\python27\\Scripts;C:\\mozilla-build\\msys\\bin;C:\\mozilla-build\\vim\\vim72;C:\\mozilla-build\\wget;C:\\mozilla-build\\info-zip;C:\\CoreUtils\\bin;C:\\mozilla-build\\buildbotve\\scripts;C:\\mozilla-build\\hg', 'PROMPT': '$P$G', 'NO_FAIL_ON_TEST_ERRORS': '1', 'PATHEXT': '.COM;.EXE;.BAT;.CMD;.VBS;.VBE;.JS;.JSE;.WSF;.WSH;.MSC', 'FP_NO_HOST_CHECK': 'NO', 'DCLOCATION': 'SCL3', 'APPDATA': 'C:\\Users\\cltbld.T-W864-IX-303\\AppData\\Roaming', 'HOMEDRIVE': 'C:', 'SYSTEMDRIVE': 'C:', 'SLAVEDIR': 'C:\\slave\\', 'NUMBER_OF_PROCESSORS': '8', 'PWD': 'C:\\slave\\test', 'PROCESSOR_LEVEL': '6', 'KTS_HOME': 'C:\\Program Files\\KTS', 'PROCESSOR_ARCHITEW6432': 'AMD64', 'MOZ_CRASHREPORTER_NO_REPORT': '1', 'COMMONPROGRAMW6432': 'C:\\Program Files\\Common Files', 'OS': 'Windows_NT', 'PUBLIC': 'C:\\Users\\Public', 'WINDIR': 'C:\\windows'}}, attempt #1 08:35:06 INFO - Running command: ['C:\\slave\\test\\build\\venv\\Scripts\\pip', 'install', '--timeout', '120', '--no-index', '--find-links', 'http://pypi.pvt.build.mozilla.org/pub', '--find-links', 'http://pypi.pub.build.mozilla.org/pub', 'mozsystemmonitor==0.3'] in C:\slave\test\build 08:35:06 INFO - Copy/paste: C:\slave\test\build\venv\Scripts\pip install --timeout 120 --no-index --find-links http://pypi.pvt.build.mozilla.org/pub --find-links http://pypi.pub.build.mozilla.org/pub mozsystemmonitor==0.3 08:35:06 INFO - Using env: {'ALLUSERSPROFILE': 'C:\\ProgramData', 08:35:06 INFO - 'APPDATA': 'C:\\Users\\cltbld.T-W864-IX-303\\AppData\\Roaming', 08:35:06 INFO - 'COMMONPROGRAMFILES': 'C:\\Program Files (x86)\\Common Files', 08:35:06 INFO - 'COMMONPROGRAMFILES(X86)': 'C:\\Program Files (x86)\\Common Files', 08:35:06 INFO - 'COMMONPROGRAMW6432': 'C:\\Program Files\\Common Files', 08:35:06 INFO - 'COMPUTERNAME': 'T-W864-IX-303', 08:35:06 INFO - 'COMSPEC': 'C:\\windows\\system32\\cmd.exe', 08:35:06 INFO - 'DCLOCATION': 'SCL3', 08:35:06 INFO - 'DNSSUFFIX': 'wintest.releng.scl3.mozilla.com', 08:35:06 INFO - 'FP_NO_HOST_CHECK': 'NO', 08:35:06 INFO - 'HOMEDRIVE': 'C:', 08:35:06 INFO - 'HOMEPATH': '\\Users\\cltbld.T-W864-IX-303', 08:35:06 INFO - 'KTS_HOME': 'C:\\Program Files\\KTS', 08:35:06 INFO - 'KTS_VERSION': '1.19c', 08:35:06 INFO - 'LOCALAPPDATA': 'C:\\Users\\cltbld.T-W864-IX-303\\AppData\\Local', 08:35:06 INFO - 'LOGONSERVER': '\\\\T-W864-IX-303', 08:35:06 INFO - 'MONDIR': 'C:\\Monitor_config\\', 08:35:06 INFO - 'MOZBUILDDIR': 'C:\\mozilla-build\\', 08:35:06 INFO - 'MOZ_CRASHREPORTER_NO_REPORT': '1', 08:35:06 INFO - 'MOZ_HIDE_RESULTS_TABLE': '1', 08:35:06 INFO - 'MOZ_NO_REMOTE': '1', 08:35:06 INFO - 'NO_EM_RESTART': '1', 08:35:06 INFO - 'NO_FAIL_ON_TEST_ERRORS': '1', 08:35:06 INFO - 'NUMBER_OF_PROCESSORS': '8', 08:35:06 INFO - 'OS': 'Windows_NT', 08:35:06 INFO - 'OURDRIVE': 'C:', 08:35:06 INFO - 'PATH': 'C:\\Program Files (x86)\\NVIDIA Corporation\\PhysX\\Common;C:\\windows\\system32;C:\\windows;C:\\windows\\System32\\Wbem;C:\\windows\\System32\\WindowsPowerShell\\v1.0\\;C:\\mozilla-build\\python27;C:\\mozilla-build\\python27\\Scripts;C:\\mozilla-build\\msys\\bin;C:\\mozilla-build\\vim\\vim72;C:\\mozilla-build\\wget;C:\\mozilla-build\\info-zip;C:\\CoreUtils\\bin;C:\\mozilla-build\\buildbotve\\scripts;C:\\mozilla-build\\hg', 08:35:06 INFO - 'PATHEXT': '.COM;.EXE;.BAT;.CMD;.VBS;.VBE;.JS;.JSE;.WSF;.WSH;.MSC', 08:35:06 INFO - 'PROCESSOR_ARCHITECTURE': 'x86', 08:35:06 INFO - 'PROCESSOR_ARCHITEW6432': 'AMD64', 08:35:06 INFO - 'PROCESSOR_IDENTIFIER': 'Intel64 Family 6 Model 30 Stepping 5, GenuineIntel', 08:35:06 INFO - 'PROCESSOR_LEVEL': '6', 08:35:06 INFO - 'PROCESSOR_REVISION': '1e05', 08:35:06 INFO - 'PROGRAMDATA': 'C:\\ProgramData', 08:35:06 INFO - 'PROGRAMFILES': 'C:\\Program Files (x86)', 08:35:06 INFO - 'PROGRAMFILES(X86)': 'C:\\Program Files (x86)', 08:35:06 INFO - 'PROGRAMW6432': 'C:\\Program Files', 08:35:06 INFO - 'PROMPT': '$P$G', 08:35:06 INFO - 'PROPERTIES_FILE': 'C:\\slave\\test/buildprops.json', 08:35:06 INFO - 'PSMODULEPATH': 'C:\\windows\\system32\\WindowsPowerShell\\v1.0\\Modules\\', 08:35:06 INFO - 'PUBLIC': 'C:\\Users\\Public', 08:35:06 INFO - 'PWD': 'C:\\slave\\test', 08:35:06 INFO - 'RUNLOGFILE': 'C:\\slave\\\\runslave.log', 08:35:06 INFO - 'SLAVEDIR': 'C:\\slave\\', 08:35:06 INFO - 'SYSTEMDRIVE': 'C:', 08:35:06 INFO - 'SYSTEMROOT': 'C:\\windows', 08:35:06 INFO - 'TEMP': 'C:\\Users\\CLTBLD~1.T-W\\AppData\\Local\\Temp', 08:35:06 INFO - 'TEST1': 'testie', 08:35:06 INFO - 'TMP': 'C:\\Users\\CLTBLD~1.T-W\\AppData\\Local\\Temp', 08:35:06 INFO - 'USERDOMAIN': 'T-W864-IX-303', 08:35:06 INFO - 'USERDOMAIN_ROAMINGPROFILE': 'T-W864-IX-303', 08:35:06 INFO - 'USERNAME': 'cltbld', 08:35:06 INFO - 'USERPROFILE': 'C:\\Users\\cltbld.T-W864-IX-303', 08:35:06 INFO - 'WINDIR': 'C:\\windows', 08:35:06 INFO - 'XPCOM_DEBUG_BREAK': 'warn'} 08:35:06 INFO - Ignoring indexes: http://pypi.python.org/simple/ 08:35:06 INFO - Downloading/unpacking mozsystemmonitor==0.3 08:35:06 INFO - Downloading mozsystemmonitor-0.3.tar.gz 08:35:06 INFO - Running setup.py egg_info for package mozsystemmonitor 08:35:06 INFO - Downloading/unpacking psutil>=3.1.1 (from mozsystemmonitor==0.3) 08:35:06 INFO - Running setup.py egg_info for package psutil 08:35:06 INFO - warning: no previously-included files matching '*' found under directory 'docs\_build' 08:35:06 INFO - warning: manifest_maker: MANIFEST.in, line 18: 'recursive-include' expects ... 08:35:06 INFO - Installing collected packages: mozsystemmonitor, psutil 08:35:06 INFO - Running setup.py install for mozsystemmonitor 08:35:06 INFO - Running setup.py install for psutil 08:35:06 INFO - building 'psutil._psutil_windows' extension 08:35:06 INFO - error: Unable to find vcvarsall.bat 08:35:06 INFO - Complete output from command C:\slave\test\build\venv\Scripts\python.exe -c "import setuptools;__file__='C:\\slave\\test\\build\\venv\\build\\psutil\\setup.py';execfile(__file__)" install --single-version-externally-managed --record c:\users\cltbld~1.t-w\appdata\local\temp\pip-ux4tik-record\install-record.txt --install-headers C:\slave\test\build\venv\include\site\python2.7: 08:35:06 INFO - running install 08:35:06 INFO - running build 08:35:06 INFO - running build_py 08:35:06 INFO - running build_ext 08:35:06 INFO - building 'psutil._psutil_windows' extension 08:35:06 INFO - error: Unable to find vcvarsall.bat 08:35:06 INFO - ---------------------------------------- 08:35:06 INFO - Command C:\slave\test\build\venv\Scripts\python.exe -c "import setuptools;__file__='C:\\slave\\test\\build\\venv\\build\\psutil\\setup.py';execfile(__file__)" install --single-version-externally-managed --record c:\users\cltbld~1.t-w\appdata\local\temp\pip-ux4tik-record\install-record.txt --install-headers C:\slave\test\build\venv\include\site\python2.7 failed with error code 1 08:35:06 INFO - Storing complete log in C:\Users\cltbld.T-W864-IX-303\AppData\Roaming\pip\pip.log 08:35:07 WARNING - Return code: 1 08:35:07 WARNING - Could not install python package: C:\slave\test\build\venv\Scripts\pip install --timeout 120 --no-index --find-links http://pypi.pvt.build.mozilla.org/pub --find-links http://pypi.pub.build.mozilla.org/pub mozsystemmonitor==0.3 failed after 1 tries! 08:35:07 INFO - Installing jsonschema==2.5.1 into virtualenv C:\slave\test\build\venv 08:35:07 INFO - proxxy config: {'regions': ['.use1.', '.usw2.', '.scl3'], 'instances': ['proxxy1.srv.releng.use1.mozilla.com', 'proxxy1.srv.releng.usw2.mozilla.com', 'proxxy1.srv.releng.scl3.mozilla.com'], 'urls': [('http://ftp.mozilla.org', 'ftp.mozilla.org'), ('https://ftp.mozilla.org', 'ftp.mozilla.org'), ('https://ftp-ssl.mozilla.org', 'ftp.mozilla.org'), ('http://pypi.pvt.build.mozilla.org', 'pypi.pvt.build.mozilla.org'), ('http://pypi.pub.build.mozilla.org', 'pypi.pub.build.mozilla.org')]} 08:35:07 INFO - http://pypi.pvt.build.mozilla.org/pub matches http://pypi.pvt.build.mozilla.org 08:35:07 INFO - proxxy config: {'regions': ['.use1.', '.usw2.', '.scl3'], 'instances': ['proxxy1.srv.releng.use1.mozilla.com', 'proxxy1.srv.releng.usw2.mozilla.com', 'proxxy1.srv.releng.scl3.mozilla.com'], 'urls': [('http://ftp.mozilla.org', 'ftp.mozilla.org'), ('https://ftp.mozilla.org', 'ftp.mozilla.org'), ('https://ftp-ssl.mozilla.org', 'ftp.mozilla.org'), ('http://pypi.pvt.build.mozilla.org', 'pypi.pvt.build.mozilla.org'), ('http://pypi.pub.build.mozilla.org', 'pypi.pub.build.mozilla.org')]} 08:35:07 INFO - http://pypi.pub.build.mozilla.org/pub matches http://pypi.pub.build.mozilla.org 08:35:07 INFO - retry: Calling run_command with args: [['C:\\slave\\test\\build\\venv\\Scripts\\pip', 'install', '--timeout', '120', '--no-index', '--find-links', 'http://pypi.pvt.build.mozilla.org/pub', '--find-links', 'http://pypi.pub.build.mozilla.org/pub', 'jsonschema==2.5.1']], kwargs: {'error_level': 'warning', 'error_list': [{'substr': 'not found or a compiler error:', 'level': 'warning'}, {'regex': <_sre.SRE_Pattern object at 0x026CB250>, 'level': 'error'}, {'regex': <_sre.SRE_Pattern object at 0x026E0188>, 'level': 'warning'}, {'regex': <_sre.SRE_Pattern object at 0x02630048>, 'level': 'debug'}, {'substr': 'command not found', 'level': 'error'}, {'regex': <_sre.SRE_Pattern object at 0x01E18DE8>, 'level': 'warning'}, {'substr': 'Traceback (most recent call last)', 'level': 'error'}, {'substr': 'SyntaxError: ', 'level': 'error'}, {'substr': 'TypeError: ', 'level': 'error'}, {'substr': 'NameError: ', 'level': 'error'}, {'substr': 'ZeroDivisionError: ', 'level': 'error'}, {'regex': <_sre.SRE_Pattern object at 0x02604230>, 'level': 'critical'}, {'regex': <_sre.SRE_Pattern object at 0x026D4520>, 'level': 'critical'}], 'cwd': 'C:\\slave\\test\\build', 'env': {'TMP': 'C:\\Users\\CLTBLD~1.T-W\\AppData\\Local\\Temp', 'TEST1': 'testie', 'COMPUTERNAME': 'T-W864-IX-303', 'USERDOMAIN': 'T-W864-IX-303', 'KTS_VERSION': '1.19c', 'PSMODULEPATH': 'C:\\windows\\system32\\WindowsPowerShell\\v1.0\\Modules\\', 'COMMONPROGRAMFILES': 'C:\\Program Files (x86)\\Common Files', 'PROCESSOR_IDENTIFIER': 'Intel64 Family 6 Model 30 Stepping 5, GenuineIntel', 'PROGRAMFILES': 'C:\\Program Files (x86)', 'PROCESSOR_REVISION': '1e05', 'DNSSUFFIX': 'wintest.releng.scl3.mozilla.com', 'SYSTEMROOT': 'C:\\windows', 'NO_EM_RESTART': '1', 'PROGRAMFILES(X86)': 'C:\\Program Files (x86)', 'OURDRIVE': 'C:', 'MOZ_HIDE_RESULTS_TABLE': '1', 'XPCOM_DEBUG_BREAK': 'warn', 'MONDIR': 'C:\\Monitor_config\\', 'TEMP': 'C:\\Users\\CLTBLD~1.T-W\\AppData\\Local\\Temp', 'COMMONPROGRAMFILES(X86)': 'C:\\Program Files (x86)\\Common Files', 'RUNLOGFILE': 'C:\\slave\\\\runslave.log', 'PROCESSOR_ARCHITECTURE': 'x86', 'ALLUSERSPROFILE': 'C:\\ProgramData', 'USERPROFILE': 'C:\\Users\\cltbld.T-W864-IX-303', 'LOCALAPPDATA': 'C:\\Users\\cltbld.T-W864-IX-303\\AppData\\Local', 'HOMEPATH': '\\Users\\cltbld.T-W864-IX-303', 'USERDOMAIN_ROAMINGPROFILE': 'T-W864-IX-303', 'MOZBUILDDIR': 'C:\\mozilla-build\\', 'PROGRAMW6432': 'C:\\Program Files', 'USERNAME': 'cltbld', 'LOGONSERVER': '\\\\T-W864-IX-303', 'MOZ_NO_REMOTE': '1', 'COMSPEC': 'C:\\windows\\system32\\cmd.exe', 'PROGRAMDATA': 'C:\\ProgramData', 'PROPERTIES_FILE': 'C:\\slave\\test/buildprops.json', 'PATH': 'C:\\Program Files (x86)\\NVIDIA Corporation\\PhysX\\Common;C:\\windows\\system32;C:\\windows;C:\\windows\\System32\\Wbem;C:\\windows\\System32\\WindowsPowerShell\\v1.0\\;C:\\mozilla-build\\python27;C:\\mozilla-build\\python27\\Scripts;C:\\mozilla-build\\msys\\bin;C:\\mozilla-build\\vim\\vim72;C:\\mozilla-build\\wget;C:\\mozilla-build\\info-zip;C:\\CoreUtils\\bin;C:\\mozilla-build\\buildbotve\\scripts;C:\\mozilla-build\\hg', 'PROMPT': '$P$G', 'NO_FAIL_ON_TEST_ERRORS': '1', 'PATHEXT': '.COM;.EXE;.BAT;.CMD;.VBS;.VBE;.JS;.JSE;.WSF;.WSH;.MSC', 'FP_NO_HOST_CHECK': 'NO', 'DCLOCATION': 'SCL3', 'APPDATA': 'C:\\Users\\cltbld.T-W864-IX-303\\AppData\\Roaming', 'HOMEDRIVE': 'C:', 'SYSTEMDRIVE': 'C:', 'SLAVEDIR': 'C:\\slave\\', 'NUMBER_OF_PROCESSORS': '8', 'PWD': 'C:\\slave\\test', 'PROCESSOR_LEVEL': '6', 'KTS_HOME': 'C:\\Program Files\\KTS', 'PROCESSOR_ARCHITEW6432': 'AMD64', 'MOZ_CRASHREPORTER_NO_REPORT': '1', 'COMMONPROGRAMW6432': 'C:\\Program Files\\Common Files', 'OS': 'Windows_NT', 'PUBLIC': 'C:\\Users\\Public', 'WINDIR': 'C:\\windows'}}, attempt #1 08:35:07 INFO - Running command: ['C:\\slave\\test\\build\\venv\\Scripts\\pip', 'install', '--timeout', '120', '--no-index', '--find-links', 'http://pypi.pvt.build.mozilla.org/pub', '--find-links', 'http://pypi.pub.build.mozilla.org/pub', 'jsonschema==2.5.1'] in C:\slave\test\build 08:35:07 INFO - Copy/paste: C:\slave\test\build\venv\Scripts\pip install --timeout 120 --no-index --find-links http://pypi.pvt.build.mozilla.org/pub --find-links http://pypi.pub.build.mozilla.org/pub jsonschema==2.5.1 08:35:07 INFO - Using env: {'ALLUSERSPROFILE': 'C:\\ProgramData', 08:35:07 INFO - 'APPDATA': 'C:\\Users\\cltbld.T-W864-IX-303\\AppData\\Roaming', 08:35:07 INFO - 'COMMONPROGRAMFILES': 'C:\\Program Files (x86)\\Common Files', 08:35:07 INFO - 'COMMONPROGRAMFILES(X86)': 'C:\\Program Files (x86)\\Common Files', 08:35:07 INFO - 'COMMONPROGRAMW6432': 'C:\\Program Files\\Common Files', 08:35:07 INFO - 'COMPUTERNAME': 'T-W864-IX-303', 08:35:07 INFO - 'COMSPEC': 'C:\\windows\\system32\\cmd.exe', 08:35:07 INFO - 'DCLOCATION': 'SCL3', 08:35:07 INFO - 'DNSSUFFIX': 'wintest.releng.scl3.mozilla.com', 08:35:07 INFO - 'FP_NO_HOST_CHECK': 'NO', 08:35:07 INFO - 'HOMEDRIVE': 'C:', 08:35:07 INFO - 'HOMEPATH': '\\Users\\cltbld.T-W864-IX-303', 08:35:07 INFO - 'KTS_HOME': 'C:\\Program Files\\KTS', 08:35:07 INFO - 'KTS_VERSION': '1.19c', 08:35:07 INFO - 'LOCALAPPDATA': 'C:\\Users\\cltbld.T-W864-IX-303\\AppData\\Local', 08:35:07 INFO - 'LOGONSERVER': '\\\\T-W864-IX-303', 08:35:07 INFO - 'MONDIR': 'C:\\Monitor_config\\', 08:35:07 INFO - 'MOZBUILDDIR': 'C:\\mozilla-build\\', 08:35:07 INFO - 'MOZ_CRASHREPORTER_NO_REPORT': '1', 08:35:07 INFO - 'MOZ_HIDE_RESULTS_TABLE': '1', 08:35:07 INFO - 'MOZ_NO_REMOTE': '1', 08:35:07 INFO - 'NO_EM_RESTART': '1', 08:35:07 INFO - 'NO_FAIL_ON_TEST_ERRORS': '1', 08:35:07 INFO - 'NUMBER_OF_PROCESSORS': '8', 08:35:07 INFO - 'OS': 'Windows_NT', 08:35:07 INFO - 'OURDRIVE': 'C:', 08:35:07 INFO - 'PATH': 'C:\\Program Files (x86)\\NVIDIA Corporation\\PhysX\\Common;C:\\windows\\system32;C:\\windows;C:\\windows\\System32\\Wbem;C:\\windows\\System32\\WindowsPowerShell\\v1.0\\;C:\\mozilla-build\\python27;C:\\mozilla-build\\python27\\Scripts;C:\\mozilla-build\\msys\\bin;C:\\mozilla-build\\vim\\vim72;C:\\mozilla-build\\wget;C:\\mozilla-build\\info-zip;C:\\CoreUtils\\bin;C:\\mozilla-build\\buildbotve\\scripts;C:\\mozilla-build\\hg', 08:35:07 INFO - 'PATHEXT': '.COM;.EXE;.BAT;.CMD;.VBS;.VBE;.JS;.JSE;.WSF;.WSH;.MSC', 08:35:07 INFO - 'PROCESSOR_ARCHITECTURE': 'x86', 08:35:07 INFO - 'PROCESSOR_ARCHITEW6432': 'AMD64', 08:35:07 INFO - 'PROCESSOR_IDENTIFIER': 'Intel64 Family 6 Model 30 Stepping 5, GenuineIntel', 08:35:07 INFO - 'PROCESSOR_LEVEL': '6', 08:35:07 INFO - 'PROCESSOR_REVISION': '1e05', 08:35:07 INFO - 'PROGRAMDATA': 'C:\\ProgramData', 08:35:07 INFO - 'PROGRAMFILES': 'C:\\Program Files (x86)', 08:35:07 INFO - 'PROGRAMFILES(X86)': 'C:\\Program Files (x86)', 08:35:07 INFO - 'PROGRAMW6432': 'C:\\Program Files', 08:35:07 INFO - 'PROMPT': '$P$G', 08:35:07 INFO - 'PROPERTIES_FILE': 'C:\\slave\\test/buildprops.json', 08:35:07 INFO - 'PSMODULEPATH': 'C:\\windows\\system32\\WindowsPowerShell\\v1.0\\Modules\\', 08:35:07 INFO - 'PUBLIC': 'C:\\Users\\Public', 08:35:07 INFO - 'PWD': 'C:\\slave\\test', 08:35:07 INFO - 'RUNLOGFILE': 'C:\\slave\\\\runslave.log', 08:35:07 INFO - 'SLAVEDIR': 'C:\\slave\\', 08:35:07 INFO - 'SYSTEMDRIVE': 'C:', 08:35:07 INFO - 'SYSTEMROOT': 'C:\\windows', 08:35:07 INFO - 'TEMP': 'C:\\Users\\CLTBLD~1.T-W\\AppData\\Local\\Temp', 08:35:07 INFO - 'TEST1': 'testie', 08:35:07 INFO - 'TMP': 'C:\\Users\\CLTBLD~1.T-W\\AppData\\Local\\Temp', 08:35:07 INFO - 'USERDOMAIN': 'T-W864-IX-303', 08:35:07 INFO - 'USERDOMAIN_ROAMINGPROFILE': 'T-W864-IX-303', 08:35:07 INFO - 'USERNAME': 'cltbld', 08:35:07 INFO - 'USERPROFILE': 'C:\\Users\\cltbld.T-W864-IX-303', 08:35:07 INFO - 'WINDIR': 'C:\\windows', 08:35:07 INFO - 'XPCOM_DEBUG_BREAK': 'warn'} 08:35:07 INFO - Ignoring indexes: http://pypi.python.org/simple/ 08:35:07 INFO - Downloading/unpacking jsonschema==2.5.1 08:35:09 INFO - Running setup.py egg_info for package jsonschema 08:35:09 INFO - zip_safe flag not set; analyzing archive contents... 08:35:09 INFO - install_dir . 08:35:09 INFO - Installed c:\slave\test\build\venv\build\jsonschema\vcversioner-2.16.0.0-py2.7.egg 08:35:09 INFO - Installing collected packages: jsonschema 08:35:09 INFO - Running setup.py install for jsonschema 08:35:09 INFO - Installing jsonschema-script.py script to C:\slave\test\build\venv\Scripts 08:35:09 INFO - Installing jsonschema.exe script to C:\slave\test\build\venv\Scripts 08:35:09 INFO - Successfully installed jsonschema 08:35:09 INFO - Cleaning up... 08:35:09 INFO - Return code: 0 08:35:09 INFO - Installing functools32==3.2.3-2 into virtualenv C:\slave\test\build\venv 08:35:09 INFO - proxxy config: {'regions': ['.use1.', '.usw2.', '.scl3'], 'instances': ['proxxy1.srv.releng.use1.mozilla.com', 'proxxy1.srv.releng.usw2.mozilla.com', 'proxxy1.srv.releng.scl3.mozilla.com'], 'urls': [('http://ftp.mozilla.org', 'ftp.mozilla.org'), ('https://ftp.mozilla.org', 'ftp.mozilla.org'), ('https://ftp-ssl.mozilla.org', 'ftp.mozilla.org'), ('http://pypi.pvt.build.mozilla.org', 'pypi.pvt.build.mozilla.org'), ('http://pypi.pub.build.mozilla.org', 'pypi.pub.build.mozilla.org')]} 08:35:09 INFO - http://pypi.pvt.build.mozilla.org/pub matches http://pypi.pvt.build.mozilla.org 08:35:09 INFO - proxxy config: {'regions': ['.use1.', '.usw2.', '.scl3'], 'instances': ['proxxy1.srv.releng.use1.mozilla.com', 'proxxy1.srv.releng.usw2.mozilla.com', 'proxxy1.srv.releng.scl3.mozilla.com'], 'urls': [('http://ftp.mozilla.org', 'ftp.mozilla.org'), ('https://ftp.mozilla.org', 'ftp.mozilla.org'), ('https://ftp-ssl.mozilla.org', 'ftp.mozilla.org'), ('http://pypi.pvt.build.mozilla.org', 'pypi.pvt.build.mozilla.org'), ('http://pypi.pub.build.mozilla.org', 'pypi.pub.build.mozilla.org')]} 08:35:09 INFO - http://pypi.pub.build.mozilla.org/pub matches http://pypi.pub.build.mozilla.org 08:35:09 INFO - retry: Calling run_command with args: [['C:\\slave\\test\\build\\venv\\Scripts\\pip', 'install', '--timeout', '120', '--no-index', '--find-links', 'http://pypi.pvt.build.mozilla.org/pub', '--find-links', 'http://pypi.pub.build.mozilla.org/pub', 'functools32==3.2.3-2']], kwargs: {'error_level': 'warning', 'error_list': [{'substr': 'not found or a compiler error:', 'level': 'warning'}, {'regex': <_sre.SRE_Pattern object at 0x026CB250>, 'level': 'error'}, {'regex': <_sre.SRE_Pattern object at 0x026E0188>, 'level': 'warning'}, {'regex': <_sre.SRE_Pattern object at 0x02630048>, 'level': 'debug'}, {'substr': 'command not found', 'level': 'error'}, {'regex': <_sre.SRE_Pattern object at 0x01E18DE8>, 'level': 'warning'}, {'substr': 'Traceback (most recent call last)', 'level': 'error'}, {'substr': 'SyntaxError: ', 'level': 'error'}, {'substr': 'TypeError: ', 'level': 'error'}, {'substr': 'NameError: ', 'level': 'error'}, {'substr': 'ZeroDivisionError: ', 'level': 'error'}, {'regex': <_sre.SRE_Pattern object at 0x02604230>, 'level': 'critical'}, {'regex': <_sre.SRE_Pattern object at 0x026D4520>, 'level': 'critical'}], 'cwd': 'C:\\slave\\test\\build', 'env': {'TMP': 'C:\\Users\\CLTBLD~1.T-W\\AppData\\Local\\Temp', 'TEST1': 'testie', 'COMPUTERNAME': 'T-W864-IX-303', 'USERDOMAIN': 'T-W864-IX-303', 'KTS_VERSION': '1.19c', 'PSMODULEPATH': 'C:\\windows\\system32\\WindowsPowerShell\\v1.0\\Modules\\', 'COMMONPROGRAMFILES': 'C:\\Program Files (x86)\\Common Files', 'PROCESSOR_IDENTIFIER': 'Intel64 Family 6 Model 30 Stepping 5, GenuineIntel', 'PROGRAMFILES': 'C:\\Program Files (x86)', 'PROCESSOR_REVISION': '1e05', 'DNSSUFFIX': 'wintest.releng.scl3.mozilla.com', 'SYSTEMROOT': 'C:\\windows', 'NO_EM_RESTART': '1', 'PROGRAMFILES(X86)': 'C:\\Program Files (x86)', 'OURDRIVE': 'C:', 'MOZ_HIDE_RESULTS_TABLE': '1', 'XPCOM_DEBUG_BREAK': 'warn', 'MONDIR': 'C:\\Monitor_config\\', 'TEMP': 'C:\\Users\\CLTBLD~1.T-W\\AppData\\Local\\Temp', 'COMMONPROGRAMFILES(X86)': 'C:\\Program Files (x86)\\Common Files', 'RUNLOGFILE': 'C:\\slave\\\\runslave.log', 'PROCESSOR_ARCHITECTURE': 'x86', 'ALLUSERSPROFILE': 'C:\\ProgramData', 'USERPROFILE': 'C:\\Users\\cltbld.T-W864-IX-303', 'LOCALAPPDATA': 'C:\\Users\\cltbld.T-W864-IX-303\\AppData\\Local', 'HOMEPATH': '\\Users\\cltbld.T-W864-IX-303', 'USERDOMAIN_ROAMINGPROFILE': 'T-W864-IX-303', 'MOZBUILDDIR': 'C:\\mozilla-build\\', 'PROGRAMW6432': 'C:\\Program Files', 'USERNAME': 'cltbld', 'LOGONSERVER': '\\\\T-W864-IX-303', 'MOZ_NO_REMOTE': '1', 'COMSPEC': 'C:\\windows\\system32\\cmd.exe', 'PROGRAMDATA': 'C:\\ProgramData', 'PROPERTIES_FILE': 'C:\\slave\\test/buildprops.json', 'PATH': 'C:\\Program Files (x86)\\NVIDIA Corporation\\PhysX\\Common;C:\\windows\\system32;C:\\windows;C:\\windows\\System32\\Wbem;C:\\windows\\System32\\WindowsPowerShell\\v1.0\\;C:\\mozilla-build\\python27;C:\\mozilla-build\\python27\\Scripts;C:\\mozilla-build\\msys\\bin;C:\\mozilla-build\\vim\\vim72;C:\\mozilla-build\\wget;C:\\mozilla-build\\info-zip;C:\\CoreUtils\\bin;C:\\mozilla-build\\buildbotve\\scripts;C:\\mozilla-build\\hg', 'PROMPT': '$P$G', 'NO_FAIL_ON_TEST_ERRORS': '1', 'PATHEXT': '.COM;.EXE;.BAT;.CMD;.VBS;.VBE;.JS;.JSE;.WSF;.WSH;.MSC', 'FP_NO_HOST_CHECK': 'NO', 'DCLOCATION': 'SCL3', 'APPDATA': 'C:\\Users\\cltbld.T-W864-IX-303\\AppData\\Roaming', 'HOMEDRIVE': 'C:', 'SYSTEMDRIVE': 'C:', 'SLAVEDIR': 'C:\\slave\\', 'NUMBER_OF_PROCESSORS': '8', 'PWD': 'C:\\slave\\test', 'PROCESSOR_LEVEL': '6', 'KTS_HOME': 'C:\\Program Files\\KTS', 'PROCESSOR_ARCHITEW6432': 'AMD64', 'MOZ_CRASHREPORTER_NO_REPORT': '1', 'COMMONPROGRAMW6432': 'C:\\Program Files\\Common Files', 'OS': 'Windows_NT', 'PUBLIC': 'C:\\Users\\Public', 'WINDIR': 'C:\\windows'}}, attempt #1 08:35:09 INFO - Running command: ['C:\\slave\\test\\build\\venv\\Scripts\\pip', 'install', '--timeout', '120', '--no-index', '--find-links', 'http://pypi.pvt.build.mozilla.org/pub', '--find-links', 'http://pypi.pub.build.mozilla.org/pub', 'functools32==3.2.3-2'] in C:\slave\test\build 08:35:09 INFO - Copy/paste: C:\slave\test\build\venv\Scripts\pip install --timeout 120 --no-index --find-links http://pypi.pvt.build.mozilla.org/pub --find-links http://pypi.pub.build.mozilla.org/pub functools32==3.2.3-2 08:35:10 INFO - Using env: {'ALLUSERSPROFILE': 'C:\\ProgramData', 08:35:10 INFO - 'APPDATA': 'C:\\Users\\cltbld.T-W864-IX-303\\AppData\\Roaming', 08:35:10 INFO - 'COMMONPROGRAMFILES': 'C:\\Program Files (x86)\\Common Files', 08:35:10 INFO - 'COMMONPROGRAMFILES(X86)': 'C:\\Program Files (x86)\\Common Files', 08:35:10 INFO - 'COMMONPROGRAMW6432': 'C:\\Program Files\\Common Files', 08:35:10 INFO - 'COMPUTERNAME': 'T-W864-IX-303', 08:35:10 INFO - 'COMSPEC': 'C:\\windows\\system32\\cmd.exe', 08:35:10 INFO - 'DCLOCATION': 'SCL3', 08:35:10 INFO - 'DNSSUFFIX': 'wintest.releng.scl3.mozilla.com', 08:35:10 INFO - 'FP_NO_HOST_CHECK': 'NO', 08:35:10 INFO - 'HOMEDRIVE': 'C:', 08:35:10 INFO - 'HOMEPATH': '\\Users\\cltbld.T-W864-IX-303', 08:35:10 INFO - 'KTS_HOME': 'C:\\Program Files\\KTS', 08:35:10 INFO - 'KTS_VERSION': '1.19c', 08:35:10 INFO - 'LOCALAPPDATA': 'C:\\Users\\cltbld.T-W864-IX-303\\AppData\\Local', 08:35:10 INFO - 'LOGONSERVER': '\\\\T-W864-IX-303', 08:35:10 INFO - 'MONDIR': 'C:\\Monitor_config\\', 08:35:10 INFO - 'MOZBUILDDIR': 'C:\\mozilla-build\\', 08:35:10 INFO - 'MOZ_CRASHREPORTER_NO_REPORT': '1', 08:35:10 INFO - 'MOZ_HIDE_RESULTS_TABLE': '1', 08:35:10 INFO - 'MOZ_NO_REMOTE': '1', 08:35:10 INFO - 'NO_EM_RESTART': '1', 08:35:10 INFO - 'NO_FAIL_ON_TEST_ERRORS': '1', 08:35:10 INFO - 'NUMBER_OF_PROCESSORS': '8', 08:35:10 INFO - 'OS': 'Windows_NT', 08:35:10 INFO - 'OURDRIVE': 'C:', 08:35:10 INFO - 'PATH': 'C:\\Program Files (x86)\\NVIDIA Corporation\\PhysX\\Common;C:\\windows\\system32;C:\\windows;C:\\windows\\System32\\Wbem;C:\\windows\\System32\\WindowsPowerShell\\v1.0\\;C:\\mozilla-build\\python27;C:\\mozilla-build\\python27\\Scripts;C:\\mozilla-build\\msys\\bin;C:\\mozilla-build\\vim\\vim72;C:\\mozilla-build\\wget;C:\\mozilla-build\\info-zip;C:\\CoreUtils\\bin;C:\\mozilla-build\\buildbotve\\scripts;C:\\mozilla-build\\hg', 08:35:10 INFO - 'PATHEXT': '.COM;.EXE;.BAT;.CMD;.VBS;.VBE;.JS;.JSE;.WSF;.WSH;.MSC', 08:35:10 INFO - 'PROCESSOR_ARCHITECTURE': 'x86', 08:35:10 INFO - 'PROCESSOR_ARCHITEW6432': 'AMD64', 08:35:10 INFO - 'PROCESSOR_IDENTIFIER': 'Intel64 Family 6 Model 30 Stepping 5, GenuineIntel', 08:35:10 INFO - 'PROCESSOR_LEVEL': '6', 08:35:10 INFO - 'PROCESSOR_REVISION': '1e05', 08:35:10 INFO - 'PROGRAMDATA': 'C:\\ProgramData', 08:35:10 INFO - 'PROGRAMFILES': 'C:\\Program Files (x86)', 08:35:10 INFO - 'PROGRAMFILES(X86)': 'C:\\Program Files (x86)', 08:35:10 INFO - 'PROGRAMW6432': 'C:\\Program Files', 08:35:10 INFO - 'PROMPT': '$P$G', 08:35:10 INFO - 'PROPERTIES_FILE': 'C:\\slave\\test/buildprops.json', 08:35:10 INFO - 'PSMODULEPATH': 'C:\\windows\\system32\\WindowsPowerShell\\v1.0\\Modules\\', 08:35:10 INFO - 'PUBLIC': 'C:\\Users\\Public', 08:35:10 INFO - 'PWD': 'C:\\slave\\test', 08:35:10 INFO - 'RUNLOGFILE': 'C:\\slave\\\\runslave.log', 08:35:10 INFO - 'SLAVEDIR': 'C:\\slave\\', 08:35:10 INFO - 'SYSTEMDRIVE': 'C:', 08:35:10 INFO - 'SYSTEMROOT': 'C:\\windows', 08:35:10 INFO - 'TEMP': 'C:\\Users\\CLTBLD~1.T-W\\AppData\\Local\\Temp', 08:35:10 INFO - 'TEST1': 'testie', 08:35:10 INFO - 'TMP': 'C:\\Users\\CLTBLD~1.T-W\\AppData\\Local\\Temp', 08:35:10 INFO - 'USERDOMAIN': 'T-W864-IX-303', 08:35:10 INFO - 'USERDOMAIN_ROAMINGPROFILE': 'T-W864-IX-303', 08:35:10 INFO - 'USERNAME': 'cltbld', 08:35:10 INFO - 'USERPROFILE': 'C:\\Users\\cltbld.T-W864-IX-303', 08:35:10 INFO - 'WINDIR': 'C:\\windows', 08:35:10 INFO - 'XPCOM_DEBUG_BREAK': 'warn'} 08:35:10 INFO - Ignoring indexes: http://pypi.python.org/simple/ 08:35:10 INFO - Downloading/unpacking functools32==3.2.3-2 08:35:10 INFO - Downloading functools32-3.2.3-2.tar.gz 08:35:10 INFO - Running setup.py egg_info for package functools32 08:35:10 INFO - warning: no files found matching '*.txt' 08:35:10 INFO - no previously-included directories found matching 'build' 08:35:10 INFO - no previously-included directories found matching 'dist' 08:35:10 INFO - no previously-included directories found matching '.git*' 08:35:10 INFO - Installing collected packages: functools32 08:35:10 INFO - Running setup.py install for functools32 08:35:10 INFO - warning: no files found matching '*.txt' 08:35:10 INFO - no previously-included directories found matching 'build' 08:35:10 INFO - no previously-included directories found matching 'dist' 08:35:10 INFO - no previously-included directories found matching '.git*' 08:35:10 INFO - Successfully installed functools32 08:35:10 INFO - Cleaning up... 08:35:10 INFO - Return code: 0 08:35:10 INFO - Installing blobuploader==1.2.4 into virtualenv C:\slave\test\build\venv 08:35:10 INFO - proxxy config: {'regions': ['.use1.', '.usw2.', '.scl3'], 'instances': ['proxxy1.srv.releng.use1.mozilla.com', 'proxxy1.srv.releng.usw2.mozilla.com', 'proxxy1.srv.releng.scl3.mozilla.com'], 'urls': [('http://ftp.mozilla.org', 'ftp.mozilla.org'), ('https://ftp.mozilla.org', 'ftp.mozilla.org'), ('https://ftp-ssl.mozilla.org', 'ftp.mozilla.org'), ('http://pypi.pvt.build.mozilla.org', 'pypi.pvt.build.mozilla.org'), ('http://pypi.pub.build.mozilla.org', 'pypi.pub.build.mozilla.org')]} 08:35:10 INFO - http://pypi.pvt.build.mozilla.org/pub matches http://pypi.pvt.build.mozilla.org 08:35:10 INFO - proxxy config: {'regions': ['.use1.', '.usw2.', '.scl3'], 'instances': ['proxxy1.srv.releng.use1.mozilla.com', 'proxxy1.srv.releng.usw2.mozilla.com', 'proxxy1.srv.releng.scl3.mozilla.com'], 'urls': [('http://ftp.mozilla.org', 'ftp.mozilla.org'), ('https://ftp.mozilla.org', 'ftp.mozilla.org'), ('https://ftp-ssl.mozilla.org', 'ftp.mozilla.org'), ('http://pypi.pvt.build.mozilla.org', 'pypi.pvt.build.mozilla.org'), ('http://pypi.pub.build.mozilla.org', 'pypi.pub.build.mozilla.org')]} 08:35:10 INFO - http://pypi.pub.build.mozilla.org/pub matches http://pypi.pub.build.mozilla.org 08:35:10 INFO - retry: Calling run_command with args: [['C:\\slave\\test\\build\\venv\\Scripts\\pip', 'install', '--timeout', '120', '--no-index', '--find-links', 'http://pypi.pvt.build.mozilla.org/pub', '--find-links', 'http://pypi.pub.build.mozilla.org/pub', 'blobuploader==1.2.4']], kwargs: {'error_level': 'warning', 'error_list': [{'substr': 'not found or a compiler error:', 'level': 'warning'}, {'regex': <_sre.SRE_Pattern object at 0x026CB250>, 'level': 'error'}, {'regex': <_sre.SRE_Pattern object at 0x026E0188>, 'level': 'warning'}, {'regex': <_sre.SRE_Pattern object at 0x02630048>, 'level': 'debug'}, {'substr': 'command not found', 'level': 'error'}, {'regex': <_sre.SRE_Pattern object at 0x01E18DE8>, 'level': 'warning'}, {'substr': 'Traceback (most recent call last)', 'level': 'error'}, {'substr': 'SyntaxError: ', 'level': 'error'}, {'substr': 'TypeError: ', 'level': 'error'}, {'substr': 'NameError: ', 'level': 'error'}, {'substr': 'ZeroDivisionError: ', 'level': 'error'}, {'regex': <_sre.SRE_Pattern object at 0x02604230>, 'level': 'critical'}, {'regex': <_sre.SRE_Pattern object at 0x026D4520>, 'level': 'critical'}], 'cwd': 'C:\\slave\\test\\build', 'env': {'TMP': 'C:\\Users\\CLTBLD~1.T-W\\AppData\\Local\\Temp', 'TEST1': 'testie', 'COMPUTERNAME': 'T-W864-IX-303', 'USERDOMAIN': 'T-W864-IX-303', 'KTS_VERSION': '1.19c', 'PSMODULEPATH': 'C:\\windows\\system32\\WindowsPowerShell\\v1.0\\Modules\\', 'COMMONPROGRAMFILES': 'C:\\Program Files (x86)\\Common Files', 'PROCESSOR_IDENTIFIER': 'Intel64 Family 6 Model 30 Stepping 5, GenuineIntel', 'PROGRAMFILES': 'C:\\Program Files (x86)', 'PROCESSOR_REVISION': '1e05', 'DNSSUFFIX': 'wintest.releng.scl3.mozilla.com', 'SYSTEMROOT': 'C:\\windows', 'NO_EM_RESTART': '1', 'PROGRAMFILES(X86)': 'C:\\Program Files (x86)', 'OURDRIVE': 'C:', 'MOZ_HIDE_RESULTS_TABLE': '1', 'XPCOM_DEBUG_BREAK': 'warn', 'MONDIR': 'C:\\Monitor_config\\', 'TEMP': 'C:\\Users\\CLTBLD~1.T-W\\AppData\\Local\\Temp', 'COMMONPROGRAMFILES(X86)': 'C:\\Program Files (x86)\\Common Files', 'RUNLOGFILE': 'C:\\slave\\\\runslave.log', 'PROCESSOR_ARCHITECTURE': 'x86', 'ALLUSERSPROFILE': 'C:\\ProgramData', 'USERPROFILE': 'C:\\Users\\cltbld.T-W864-IX-303', 'LOCALAPPDATA': 'C:\\Users\\cltbld.T-W864-IX-303\\AppData\\Local', 'HOMEPATH': '\\Users\\cltbld.T-W864-IX-303', 'USERDOMAIN_ROAMINGPROFILE': 'T-W864-IX-303', 'MOZBUILDDIR': 'C:\\mozilla-build\\', 'PROGRAMW6432': 'C:\\Program Files', 'USERNAME': 'cltbld', 'LOGONSERVER': '\\\\T-W864-IX-303', 'MOZ_NO_REMOTE': '1', 'COMSPEC': 'C:\\windows\\system32\\cmd.exe', 'PROGRAMDATA': 'C:\\ProgramData', 'PROPERTIES_FILE': 'C:\\slave\\test/buildprops.json', 'PATH': 'C:\\Program Files (x86)\\NVIDIA Corporation\\PhysX\\Common;C:\\windows\\system32;C:\\windows;C:\\windows\\System32\\Wbem;C:\\windows\\System32\\WindowsPowerShell\\v1.0\\;C:\\mozilla-build\\python27;C:\\mozilla-build\\python27\\Scripts;C:\\mozilla-build\\msys\\bin;C:\\mozilla-build\\vim\\vim72;C:\\mozilla-build\\wget;C:\\mozilla-build\\info-zip;C:\\CoreUtils\\bin;C:\\mozilla-build\\buildbotve\\scripts;C:\\mozilla-build\\hg', 'PROMPT': '$P$G', 'NO_FAIL_ON_TEST_ERRORS': '1', 'PATHEXT': '.COM;.EXE;.BAT;.CMD;.VBS;.VBE;.JS;.JSE;.WSF;.WSH;.MSC', 'FP_NO_HOST_CHECK': 'NO', 'DCLOCATION': 'SCL3', 'APPDATA': 'C:\\Users\\cltbld.T-W864-IX-303\\AppData\\Roaming', 'HOMEDRIVE': 'C:', 'SYSTEMDRIVE': 'C:', 'SLAVEDIR': 'C:\\slave\\', 'NUMBER_OF_PROCESSORS': '8', 'PWD': 'C:\\slave\\test', 'PROCESSOR_LEVEL': '6', 'KTS_HOME': 'C:\\Program Files\\KTS', 'PROCESSOR_ARCHITEW6432': 'AMD64', 'MOZ_CRASHREPORTER_NO_REPORT': '1', 'COMMONPROGRAMW6432': 'C:\\Program Files\\Common Files', 'OS': 'Windows_NT', 'PUBLIC': 'C:\\Users\\Public', 'WINDIR': 'C:\\windows'}}, attempt #1 08:35:10 INFO - Running command: ['C:\\slave\\test\\build\\venv\\Scripts\\pip', 'install', '--timeout', '120', '--no-index', '--find-links', 'http://pypi.pvt.build.mozilla.org/pub', '--find-links', 'http://pypi.pub.build.mozilla.org/pub', 'blobuploader==1.2.4'] in C:\slave\test\build 08:35:10 INFO - Copy/paste: C:\slave\test\build\venv\Scripts\pip install --timeout 120 --no-index --find-links http://pypi.pvt.build.mozilla.org/pub --find-links http://pypi.pub.build.mozilla.org/pub blobuploader==1.2.4 08:35:10 INFO - Using env: {'ALLUSERSPROFILE': 'C:\\ProgramData', 08:35:10 INFO - 'APPDATA': 'C:\\Users\\cltbld.T-W864-IX-303\\AppData\\Roaming', 08:35:10 INFO - 'COMMONPROGRAMFILES': 'C:\\Program Files (x86)\\Common Files', 08:35:10 INFO - 'COMMONPROGRAMFILES(X86)': 'C:\\Program Files (x86)\\Common Files', 08:35:10 INFO - 'COMMONPROGRAMW6432': 'C:\\Program Files\\Common Files', 08:35:10 INFO - 'COMPUTERNAME': 'T-W864-IX-303', 08:35:10 INFO - 'COMSPEC': 'C:\\windows\\system32\\cmd.exe', 08:35:10 INFO - 'DCLOCATION': 'SCL3', 08:35:10 INFO - 'DNSSUFFIX': 'wintest.releng.scl3.mozilla.com', 08:35:10 INFO - 'FP_NO_HOST_CHECK': 'NO', 08:35:10 INFO - 'HOMEDRIVE': 'C:', 08:35:10 INFO - 'HOMEPATH': '\\Users\\cltbld.T-W864-IX-303', 08:35:10 INFO - 'KTS_HOME': 'C:\\Program Files\\KTS', 08:35:10 INFO - 'KTS_VERSION': '1.19c', 08:35:10 INFO - 'LOCALAPPDATA': 'C:\\Users\\cltbld.T-W864-IX-303\\AppData\\Local', 08:35:10 INFO - 'LOGONSERVER': '\\\\T-W864-IX-303', 08:35:10 INFO - 'MONDIR': 'C:\\Monitor_config\\', 08:35:10 INFO - 'MOZBUILDDIR': 'C:\\mozilla-build\\', 08:35:10 INFO - 'MOZ_CRASHREPORTER_NO_REPORT': '1', 08:35:10 INFO - 'MOZ_HIDE_RESULTS_TABLE': '1', 08:35:10 INFO - 'MOZ_NO_REMOTE': '1', 08:35:10 INFO - 'NO_EM_RESTART': '1', 08:35:10 INFO - 'NO_FAIL_ON_TEST_ERRORS': '1', 08:35:10 INFO - 'NUMBER_OF_PROCESSORS': '8', 08:35:10 INFO - 'OS': 'Windows_NT', 08:35:10 INFO - 'OURDRIVE': 'C:', 08:35:10 INFO - 'PATH': 'C:\\Program Files (x86)\\NVIDIA Corporation\\PhysX\\Common;C:\\windows\\system32;C:\\windows;C:\\windows\\System32\\Wbem;C:\\windows\\System32\\WindowsPowerShell\\v1.0\\;C:\\mozilla-build\\python27;C:\\mozilla-build\\python27\\Scripts;C:\\mozilla-build\\msys\\bin;C:\\mozilla-build\\vim\\vim72;C:\\mozilla-build\\wget;C:\\mozilla-build\\info-zip;C:\\CoreUtils\\bin;C:\\mozilla-build\\buildbotve\\scripts;C:\\mozilla-build\\hg', 08:35:10 INFO - 'PATHEXT': '.COM;.EXE;.BAT;.CMD;.VBS;.VBE;.JS;.JSE;.WSF;.WSH;.MSC', 08:35:10 INFO - 'PROCESSOR_ARCHITECTURE': 'x86', 08:35:10 INFO - 'PROCESSOR_ARCHITEW6432': 'AMD64', 08:35:10 INFO - 'PROCESSOR_IDENTIFIER': 'Intel64 Family 6 Model 30 Stepping 5, GenuineIntel', 08:35:10 INFO - 'PROCESSOR_LEVEL': '6', 08:35:10 INFO - 'PROCESSOR_REVISION': '1e05', 08:35:10 INFO - 'PROGRAMDATA': 'C:\\ProgramData', 08:35:10 INFO - 'PROGRAMFILES': 'C:\\Program Files (x86)', 08:35:10 INFO - 'PROGRAMFILES(X86)': 'C:\\Program Files (x86)', 08:35:10 INFO - 'PROGRAMW6432': 'C:\\Program Files', 08:35:10 INFO - 'PROMPT': '$P$G', 08:35:10 INFO - 'PROPERTIES_FILE': 'C:\\slave\\test/buildprops.json', 08:35:10 INFO - 'PSMODULEPATH': 'C:\\windows\\system32\\WindowsPowerShell\\v1.0\\Modules\\', 08:35:10 INFO - 'PUBLIC': 'C:\\Users\\Public', 08:35:10 INFO - 'PWD': 'C:\\slave\\test', 08:35:10 INFO - 'RUNLOGFILE': 'C:\\slave\\\\runslave.log', 08:35:10 INFO - 'SLAVEDIR': 'C:\\slave\\', 08:35:10 INFO - 'SYSTEMDRIVE': 'C:', 08:35:10 INFO - 'SYSTEMROOT': 'C:\\windows', 08:35:10 INFO - 'TEMP': 'C:\\Users\\CLTBLD~1.T-W\\AppData\\Local\\Temp', 08:35:10 INFO - 'TEST1': 'testie', 08:35:10 INFO - 'TMP': 'C:\\Users\\CLTBLD~1.T-W\\AppData\\Local\\Temp', 08:35:10 INFO - 'USERDOMAIN': 'T-W864-IX-303', 08:35:10 INFO - 'USERDOMAIN_ROAMINGPROFILE': 'T-W864-IX-303', 08:35:10 INFO - 'USERNAME': 'cltbld', 08:35:10 INFO - 'USERPROFILE': 'C:\\Users\\cltbld.T-W864-IX-303', 08:35:10 INFO - 'WINDIR': 'C:\\windows', 08:35:10 INFO - 'XPCOM_DEBUG_BREAK': 'warn'} 08:35:11 INFO - Ignoring indexes: http://pypi.python.org/simple/ 08:35:11 INFO - Downloading/unpacking blobuploader==1.2.4 08:35:11 INFO - Downloading blobuploader-1.2.4.tar.gz 08:35:11 INFO - Running setup.py egg_info for package blobuploader 08:35:11 INFO - Downloading/unpacking requests==1.2.3. (from blobuploader==1.2.4) 08:35:14 INFO - Running setup.py egg_info for package requests 08:35:14 INFO - Downloading/unpacking docopt==0.6.1 (from blobuploader==1.2.4) 08:35:14 INFO - Downloading docopt-0.6.1.tar.gz 08:35:14 INFO - Running setup.py egg_info for package docopt 08:35:14 INFO - Installing collected packages: blobuploader, docopt, requests 08:35:14 INFO - Running setup.py install for blobuploader 08:35:14 INFO - Running setup.py install for docopt 08:35:14 INFO - Running setup.py install for requests 08:35:14 INFO - Successfully installed blobuploader docopt requests 08:35:14 INFO - Cleaning up... 08:35:14 INFO - Return code: 0 08:35:14 INFO - Installing None into virtualenv C:\slave\test\build\venv 08:35:14 INFO - proxxy config: {'regions': ['.use1.', '.usw2.', '.scl3'], 'instances': ['proxxy1.srv.releng.use1.mozilla.com', 'proxxy1.srv.releng.usw2.mozilla.com', 'proxxy1.srv.releng.scl3.mozilla.com'], 'urls': [('http://ftp.mozilla.org', 'ftp.mozilla.org'), ('https://ftp.mozilla.org', 'ftp.mozilla.org'), ('https://ftp-ssl.mozilla.org', 'ftp.mozilla.org'), ('http://pypi.pvt.build.mozilla.org', 'pypi.pvt.build.mozilla.org'), ('http://pypi.pub.build.mozilla.org', 'pypi.pub.build.mozilla.org')]} 08:35:14 INFO - http://pypi.pvt.build.mozilla.org/pub matches http://pypi.pvt.build.mozilla.org 08:35:14 INFO - proxxy config: {'regions': ['.use1.', '.usw2.', '.scl3'], 'instances': ['proxxy1.srv.releng.use1.mozilla.com', 'proxxy1.srv.releng.usw2.mozilla.com', 'proxxy1.srv.releng.scl3.mozilla.com'], 'urls': [('http://ftp.mozilla.org', 'ftp.mozilla.org'), ('https://ftp.mozilla.org', 'ftp.mozilla.org'), ('https://ftp-ssl.mozilla.org', 'ftp.mozilla.org'), ('http://pypi.pvt.build.mozilla.org', 'pypi.pvt.build.mozilla.org'), ('http://pypi.pub.build.mozilla.org', 'pypi.pub.build.mozilla.org')]} 08:35:14 INFO - http://pypi.pub.build.mozilla.org/pub matches http://pypi.pub.build.mozilla.org 08:35:14 INFO - retry: Calling run_command with args: [['C:\\slave\\test\\build\\venv\\Scripts\\pip', 'install', '--no-deps', '--timeout', '120', '-r', 'C:\\slave\\test\\build\\tests\\config\\marionette_requirements.txt', '--no-index', '--find-links', 'http://pypi.pvt.build.mozilla.org/pub', '--find-links', 'http://pypi.pub.build.mozilla.org/pub']], kwargs: {'error_level': 'warning', 'error_list': [{'substr': 'not found or a compiler error:', 'level': 'warning'}, {'regex': <_sre.SRE_Pattern object at 0x026CB250>, 'level': 'error'}, {'regex': <_sre.SRE_Pattern object at 0x026E0188>, 'level': 'warning'}, {'regex': <_sre.SRE_Pattern object at 0x02630048>, 'level': 'debug'}, {'substr': 'command not found', 'level': 'error'}, {'regex': <_sre.SRE_Pattern object at 0x01E18DE8>, 'level': 'warning'}, {'substr': 'Traceback (most recent call last)', 'level': 'error'}, {'substr': 'SyntaxError: ', 'level': 'error'}, {'substr': 'TypeError: ', 'level': 'error'}, {'substr': 'NameError: ', 'level': 'error'}, {'substr': 'ZeroDivisionError: ', 'level': 'error'}, {'regex': <_sre.SRE_Pattern object at 0x02604230>, 'level': 'critical'}, {'regex': <_sre.SRE_Pattern object at 0x026D4520>, 'level': 'critical'}], 'cwd': 'C:\\slave\\test\\build\\tests\\config', 'env': {'TMP': 'C:\\Users\\CLTBLD~1.T-W\\AppData\\Local\\Temp', 'TEST1': 'testie', 'COMPUTERNAME': 'T-W864-IX-303', 'USERDOMAIN': 'T-W864-IX-303', 'KTS_VERSION': '1.19c', 'PSMODULEPATH': 'C:\\windows\\system32\\WindowsPowerShell\\v1.0\\Modules\\', 'COMMONPROGRAMFILES': 'C:\\Program Files (x86)\\Common Files', 'PROCESSOR_IDENTIFIER': 'Intel64 Family 6 Model 30 Stepping 5, GenuineIntel', 'PROGRAMFILES': 'C:\\Program Files (x86)', 'PROCESSOR_REVISION': '1e05', 'DNSSUFFIX': 'wintest.releng.scl3.mozilla.com', 'SYSTEMROOT': 'C:\\windows', 'NO_EM_RESTART': '1', 'PROGRAMFILES(X86)': 'C:\\Program Files (x86)', 'OURDRIVE': 'C:', 'MOZ_HIDE_RESULTS_TABLE': '1', 'XPCOM_DEBUG_BREAK': 'warn', 'MONDIR': 'C:\\Monitor_config\\', 'TEMP': 'C:\\Users\\CLTBLD~1.T-W\\AppData\\Local\\Temp', 'COMMONPROGRAMFILES(X86)': 'C:\\Program Files (x86)\\Common Files', 'RUNLOGFILE': 'C:\\slave\\\\runslave.log', 'PROCESSOR_ARCHITECTURE': 'x86', 'ALLUSERSPROFILE': 'C:\\ProgramData', 'USERPROFILE': 'C:\\Users\\cltbld.T-W864-IX-303', 'LOCALAPPDATA': 'C:\\Users\\cltbld.T-W864-IX-303\\AppData\\Local', 'HOMEPATH': '\\Users\\cltbld.T-W864-IX-303', 'USERDOMAIN_ROAMINGPROFILE': 'T-W864-IX-303', 'MOZBUILDDIR': 'C:\\mozilla-build\\', 'PROGRAMW6432': 'C:\\Program Files', 'USERNAME': 'cltbld', 'LOGONSERVER': '\\\\T-W864-IX-303', 'MOZ_NO_REMOTE': '1', 'COMSPEC': 'C:\\windows\\system32\\cmd.exe', 'PROGRAMDATA': 'C:\\ProgramData', 'PROPERTIES_FILE': 'C:\\slave\\test/buildprops.json', 'PATH': 'C:\\Program Files (x86)\\NVIDIA Corporation\\PhysX\\Common;C:\\windows\\system32;C:\\windows;C:\\windows\\System32\\Wbem;C:\\windows\\System32\\WindowsPowerShell\\v1.0\\;C:\\mozilla-build\\python27;C:\\mozilla-build\\python27\\Scripts;C:\\mozilla-build\\msys\\bin;C:\\mozilla-build\\vim\\vim72;C:\\mozilla-build\\wget;C:\\mozilla-build\\info-zip;C:\\CoreUtils\\bin;C:\\mozilla-build\\buildbotve\\scripts;C:\\mozilla-build\\hg', 'PROMPT': '$P$G', 'NO_FAIL_ON_TEST_ERRORS': '1', 'PATHEXT': '.COM;.EXE;.BAT;.CMD;.VBS;.VBE;.JS;.JSE;.WSF;.WSH;.MSC', 'FP_NO_HOST_CHECK': 'NO', 'DCLOCATION': 'SCL3', 'APPDATA': 'C:\\Users\\cltbld.T-W864-IX-303\\AppData\\Roaming', 'HOMEDRIVE': 'C:', 'SYSTEMDRIVE': 'C:', 'SLAVEDIR': 'C:\\slave\\', 'NUMBER_OF_PROCESSORS': '8', 'PWD': 'C:\\slave\\test', 'PROCESSOR_LEVEL': '6', 'KTS_HOME': 'C:\\Program Files\\KTS', 'PROCESSOR_ARCHITEW6432': 'AMD64', 'MOZ_CRASHREPORTER_NO_REPORT': '1', 'COMMONPROGRAMW6432': 'C:\\Program Files\\Common Files', 'OS': 'Windows_NT', 'PUBLIC': 'C:\\Users\\Public', 'WINDIR': 'C:\\windows'}}, attempt #1 08:35:14 INFO - Running command: ['C:\\slave\\test\\build\\venv\\Scripts\\pip', 'install', '--no-deps', '--timeout', '120', '-r', 'C:\\slave\\test\\build\\tests\\config\\marionette_requirements.txt', '--no-index', '--find-links', 'http://pypi.pvt.build.mozilla.org/pub', '--find-links', 'http://pypi.pub.build.mozilla.org/pub'] in C:\slave\test\build\tests\config 08:35:14 INFO - Copy/paste: C:\slave\test\build\venv\Scripts\pip install --no-deps --timeout 120 -r C:\slave\test\build\tests\config\marionette_requirements.txt --no-index --find-links http://pypi.pvt.build.mozilla.org/pub --find-links http://pypi.pub.build.mozilla.org/pub 08:35:14 INFO - Using env: {'ALLUSERSPROFILE': 'C:\\ProgramData', 08:35:14 INFO - 'APPDATA': 'C:\\Users\\cltbld.T-W864-IX-303\\AppData\\Roaming', 08:35:14 INFO - 'COMMONPROGRAMFILES': 'C:\\Program Files (x86)\\Common Files', 08:35:14 INFO - 'COMMONPROGRAMFILES(X86)': 'C:\\Program Files (x86)\\Common Files', 08:35:14 INFO - 'COMMONPROGRAMW6432': 'C:\\Program Files\\Common Files', 08:35:14 INFO - 'COMPUTERNAME': 'T-W864-IX-303', 08:35:14 INFO - 'COMSPEC': 'C:\\windows\\system32\\cmd.exe', 08:35:14 INFO - 'DCLOCATION': 'SCL3', 08:35:14 INFO - 'DNSSUFFIX': 'wintest.releng.scl3.mozilla.com', 08:35:14 INFO - 'FP_NO_HOST_CHECK': 'NO', 08:35:14 INFO - 'HOMEDRIVE': 'C:', 08:35:14 INFO - 'HOMEPATH': '\\Users\\cltbld.T-W864-IX-303', 08:35:14 INFO - 'KTS_HOME': 'C:\\Program Files\\KTS', 08:35:14 INFO - 'KTS_VERSION': '1.19c', 08:35:14 INFO - 'LOCALAPPDATA': 'C:\\Users\\cltbld.T-W864-IX-303\\AppData\\Local', 08:35:14 INFO - 'LOGONSERVER': '\\\\T-W864-IX-303', 08:35:14 INFO - 'MONDIR': 'C:\\Monitor_config\\', 08:35:14 INFO - 'MOZBUILDDIR': 'C:\\mozilla-build\\', 08:35:14 INFO - 'MOZ_CRASHREPORTER_NO_REPORT': '1', 08:35:14 INFO - 'MOZ_HIDE_RESULTS_TABLE': '1', 08:35:14 INFO - 'MOZ_NO_REMOTE': '1', 08:35:14 INFO - 'NO_EM_RESTART': '1', 08:35:14 INFO - 'NO_FAIL_ON_TEST_ERRORS': '1', 08:35:14 INFO - 'NUMBER_OF_PROCESSORS': '8', 08:35:14 INFO - 'OS': 'Windows_NT', 08:35:14 INFO - 'OURDRIVE': 'C:', 08:35:14 INFO - 'PATH': 'C:\\Program Files (x86)\\NVIDIA Corporation\\PhysX\\Common;C:\\windows\\system32;C:\\windows;C:\\windows\\System32\\Wbem;C:\\windows\\System32\\WindowsPowerShell\\v1.0\\;C:\\mozilla-build\\python27;C:\\mozilla-build\\python27\\Scripts;C:\\mozilla-build\\msys\\bin;C:\\mozilla-build\\vim\\vim72;C:\\mozilla-build\\wget;C:\\mozilla-build\\info-zip;C:\\CoreUtils\\bin;C:\\mozilla-build\\buildbotve\\scripts;C:\\mozilla-build\\hg', 08:35:14 INFO - 'PATHEXT': '.COM;.EXE;.BAT;.CMD;.VBS;.VBE;.JS;.JSE;.WSF;.WSH;.MSC', 08:35:14 INFO - 'PROCESSOR_ARCHITECTURE': 'x86', 08:35:14 INFO - 'PROCESSOR_ARCHITEW6432': 'AMD64', 08:35:14 INFO - 'PROCESSOR_IDENTIFIER': 'Intel64 Family 6 Model 30 Stepping 5, GenuineIntel', 08:35:14 INFO - 'PROCESSOR_LEVEL': '6', 08:35:14 INFO - 'PROCESSOR_REVISION': '1e05', 08:35:14 INFO - 'PROGRAMDATA': 'C:\\ProgramData', 08:35:14 INFO - 'PROGRAMFILES': 'C:\\Program Files (x86)', 08:35:14 INFO - 'PROGRAMFILES(X86)': 'C:\\Program Files (x86)', 08:35:14 INFO - 'PROGRAMW6432': 'C:\\Program Files', 08:35:14 INFO - 'PROMPT': '$P$G', 08:35:14 INFO - 'PROPERTIES_FILE': 'C:\\slave\\test/buildprops.json', 08:35:14 INFO - 'PSMODULEPATH': 'C:\\windows\\system32\\WindowsPowerShell\\v1.0\\Modules\\', 08:35:14 INFO - 'PUBLIC': 'C:\\Users\\Public', 08:35:14 INFO - 'PWD': 'C:\\slave\\test', 08:35:14 INFO - 'RUNLOGFILE': 'C:\\slave\\\\runslave.log', 08:35:14 INFO - 'SLAVEDIR': 'C:\\slave\\', 08:35:14 INFO - 'SYSTEMDRIVE': 'C:', 08:35:14 INFO - 'SYSTEMROOT': 'C:\\windows', 08:35:14 INFO - 'TEMP': 'C:\\Users\\CLTBLD~1.T-W\\AppData\\Local\\Temp', 08:35:14 INFO - 'TEST1': 'testie', 08:35:14 INFO - 'TMP': 'C:\\Users\\CLTBLD~1.T-W\\AppData\\Local\\Temp', 08:35:14 INFO - 'USERDOMAIN': 'T-W864-IX-303', 08:35:14 INFO - 'USERDOMAIN_ROAMINGPROFILE': 'T-W864-IX-303', 08:35:14 INFO - 'USERNAME': 'cltbld', 08:35:14 INFO - 'USERPROFILE': 'C:\\Users\\cltbld.T-W864-IX-303', 08:35:14 INFO - 'WINDIR': 'C:\\windows', 08:35:14 INFO - 'XPCOM_DEBUG_BREAK': 'warn'} 08:35:17 INFO - Ignoring indexes: http://pypi.python.org/simple/ 08:35:17 INFO - Unpacking c:\slave\test\build\tests\mozbase\manifestparser 08:35:17 INFO - Running setup.py egg_info for package from file:///c%7C%5Cslave%5Ctest%5Cbuild%5Ctests%5Cmozbase%5Cmanifestparser 08:35:17 INFO - Unpacking c:\slave\test\build\tests\mozbase\mozcrash 08:35:17 INFO - Running setup.py egg_info for package from file:///c%7C%5Cslave%5Ctest%5Cbuild%5Ctests%5Cmozbase%5Cmozcrash 08:35:17 INFO - Unpacking c:\slave\test\build\tests\mozbase\mozdebug 08:35:17 INFO - Running setup.py egg_info for package from file:///c%7C%5Cslave%5Ctest%5Cbuild%5Ctests%5Cmozbase%5Cmozdebug 08:35:17 INFO - Unpacking c:\slave\test\build\tests\mozbase\mozdevice 08:35:17 INFO - Running setup.py egg_info for package from file:///c%7C%5Cslave%5Ctest%5Cbuild%5Ctests%5Cmozbase%5Cmozdevice 08:35:17 INFO - Unpacking c:\slave\test\build\tests\mozbase\mozfile 08:35:17 INFO - Running setup.py egg_info for package from file:///c%7C%5Cslave%5Ctest%5Cbuild%5Ctests%5Cmozbase%5Cmozfile 08:35:17 INFO - Unpacking c:\slave\test\build\tests\mozbase\mozhttpd 08:35:17 INFO - Running setup.py egg_info for package from file:///c%7C%5Cslave%5Ctest%5Cbuild%5Ctests%5Cmozbase%5Cmozhttpd 08:35:17 INFO - Unpacking c:\slave\test\build\tests\mozbase\mozinfo 08:35:17 INFO - Running setup.py egg_info for package from file:///c%7C%5Cslave%5Ctest%5Cbuild%5Ctests%5Cmozbase%5Cmozinfo 08:35:17 INFO - Unpacking c:\slave\test\build\tests\mozbase\mozinstall 08:35:17 INFO - Running setup.py egg_info for package from file:///c%7C%5Cslave%5Ctest%5Cbuild%5Ctests%5Cmozbase%5Cmozinstall 08:35:17 INFO - Unpacking c:\slave\test\build\tests\mozbase\mozleak 08:35:17 INFO - Running setup.py egg_info for package from file:///c%7C%5Cslave%5Ctest%5Cbuild%5Ctests%5Cmozbase%5Cmozleak 08:35:17 INFO - Unpacking c:\slave\test\build\tests\mozbase\mozlog 08:35:17 INFO - Running setup.py egg_info for package from file:///c%7C%5Cslave%5Ctest%5Cbuild%5Ctests%5Cmozbase%5Cmozlog 08:35:17 INFO - Unpacking c:\slave\test\build\tests\mozbase\moznetwork 08:35:17 INFO - Running setup.py egg_info for package from file:///c%7C%5Cslave%5Ctest%5Cbuild%5Ctests%5Cmozbase%5Cmoznetwork 08:35:17 INFO - Unpacking c:\slave\test\build\tests\mozbase\mozprocess 08:35:17 INFO - Running setup.py egg_info for package from file:///c%7C%5Cslave%5Ctest%5Cbuild%5Ctests%5Cmozbase%5Cmozprocess 08:35:17 INFO - Unpacking c:\slave\test\build\tests\mozbase\mozprofile 08:35:17 INFO - Running setup.py egg_info for package from file:///c%7C%5Cslave%5Ctest%5Cbuild%5Ctests%5Cmozbase%5Cmozprofile 08:35:17 INFO - Unpacking c:\slave\test\build\tests\mozbase\mozrunner 08:35:17 INFO - Running setup.py egg_info for package from file:///c%7C%5Cslave%5Ctest%5Cbuild%5Ctests%5Cmozbase%5Cmozrunner 08:35:17 INFO - Unpacking c:\slave\test\build\tests\mozbase\mozscreenshot 08:35:17 INFO - Running setup.py egg_info for package from file:///c%7C%5Cslave%5Ctest%5Cbuild%5Ctests%5Cmozbase%5Cmozscreenshot 08:35:17 INFO - Unpacking c:\slave\test\build\tests\mozbase\moztest 08:35:17 INFO - Running setup.py egg_info for package from file:///c%7C%5Cslave%5Ctest%5Cbuild%5Ctests%5Cmozbase%5Cmoztest 08:35:17 INFO - Unpacking c:\slave\test\build\tests\mozbase\mozversion 08:35:17 INFO - Running setup.py egg_info for package from file:///c%7C%5Cslave%5Ctest%5Cbuild%5Ctests%5Cmozbase%5Cmozversion 08:35:17 INFO - Unpacking c:\slave\test\build\tests\tools\wptserve 08:35:17 INFO - Running setup.py egg_info for package from file:///c%7C%5Cslave%5Ctest%5Cbuild%5Ctests%5Ctools%5Cwptserve 08:35:17 INFO - Unpacking c:\slave\test\build\tests\marionette\client 08:35:17 INFO - Running setup.py egg_info for package from file:///c%7C%5Cslave%5Ctest%5Cbuild%5Ctests%5Cmarionette%5Cclient 08:35:17 INFO - Unpacking c:\slave\test\build\tests\marionette\harness\marionette_harness\runner\mixins\browsermob-proxy-py 08:35:17 INFO - Running setup.py egg_info for package from file:///c%7C%5Cslave%5Ctest%5Cbuild%5Ctests%5Cmarionette%5Charness%5Cmarionette_harness%5Crunner%5Cmixins%5Cbrowsermob-proxy-py 08:35:17 INFO - Unpacking c:\slave\test\build\tests\marionette\harness 08:35:17 INFO - Running setup.py egg_info for package from file:///c%7C%5Cslave%5Ctest%5Cbuild%5Ctests%5Cmarionette%5Charness 08:35:17 INFO - Unpacking c:\slave\test\build\tests\marionette\puppeteer\firefox 08:35:17 INFO - Running setup.py egg_info for package from file:///c%7C%5Cslave%5Ctest%5Cbuild%5Ctests%5Cmarionette%5Cpuppeteer%5Cfirefox 08:35:30 INFO - Installing collected packages: browsermob-proxy, firefox-puppeteer, manifestparser, marionette-driver, marionette-harness, mozcrash, mozdebug, mozdevice, mozfile, mozhttpd, mozinfo, mozInstall, mozleak, mozlog, moznetwork, mozprocess, mozprofile, mozrunner, mozscreenshot, moztest, mozversion, wptserve 08:35:30 INFO - Running setup.py install for browsermob-proxy 08:35:30 INFO - Running setup.py install for firefox-puppeteer 08:35:30 INFO - Running setup.py install for manifestparser 08:35:30 INFO - Installing manifestparser-script.py script to C:\slave\test\build\venv\Scripts 08:35:30 INFO - Installing manifestparser.exe script to C:\slave\test\build\venv\Scripts 08:35:30 INFO - Running setup.py install for marionette-driver 08:35:30 INFO - Running setup.py install for marionette-harness 08:35:30 INFO - Installing marionette-script.py script to C:\slave\test\build\venv\Scripts 08:35:30 INFO - Installing marionette.exe script to C:\slave\test\build\venv\Scripts 08:35:30 INFO - Running setup.py install for mozcrash 08:35:30 INFO - Running setup.py install for mozdebug 08:35:30 INFO - Running setup.py install for mozdevice 08:35:30 INFO - Installing sutini-script.py script to C:\slave\test\build\venv\Scripts 08:35:30 INFO - Installing sutini.exe script to C:\slave\test\build\venv\Scripts 08:35:30 INFO - Installing dm-script.py script to C:\slave\test\build\venv\Scripts 08:35:30 INFO - Installing dm.exe script to C:\slave\test\build\venv\Scripts 08:35:30 INFO - Running setup.py install for mozfile 08:35:30 INFO - Running setup.py install for mozhttpd 08:35:30 INFO - Installing mozhttpd-script.py script to C:\slave\test\build\venv\Scripts 08:35:30 INFO - Installing mozhttpd.exe script to C:\slave\test\build\venv\Scripts 08:35:30 INFO - Running setup.py install for mozinfo 08:35:30 INFO - Installing mozinfo-script.py script to C:\slave\test\build\venv\Scripts 08:35:30 INFO - Installing mozinfo.exe script to C:\slave\test\build\venv\Scripts 08:35:30 INFO - Running setup.py install for mozInstall 08:35:30 INFO - Installing moz_remove_from_system-script.py script to C:\slave\test\build\venv\Scripts 08:35:30 INFO - Installing moz_remove_from_system.exe script to C:\slave\test\build\venv\Scripts 08:35:30 INFO - Installing mozuninstall-script.py script to C:\slave\test\build\venv\Scripts 08:35:30 INFO - Installing mozuninstall.exe script to C:\slave\test\build\venv\Scripts 08:35:30 INFO - Installing mozinstall-script.py script to C:\slave\test\build\venv\Scripts 08:35:30 INFO - Installing mozinstall.exe script to C:\slave\test\build\venv\Scripts 08:35:30 INFO - Installing moz_add_to_system-script.py script to C:\slave\test\build\venv\Scripts 08:35:30 INFO - Installing moz_add_to_system.exe script to C:\slave\test\build\venv\Scripts 08:35:30 INFO - Running setup.py install for mozleak 08:35:30 INFO - Running setup.py install for mozlog 08:35:30 INFO - Installing structlog-script.py script to C:\slave\test\build\venv\Scripts 08:35:30 INFO - Installing structlog.exe script to C:\slave\test\build\venv\Scripts 08:35:30 INFO - Running setup.py install for moznetwork 08:35:30 INFO - Installing moznetwork-script.py script to C:\slave\test\build\venv\Scripts 08:35:30 INFO - Installing moznetwork.exe script to C:\slave\test\build\venv\Scripts 08:35:30 INFO - Running setup.py install for mozprocess 08:35:30 INFO - Running setup.py install for mozprofile 08:35:30 INFO - Installing mozprofile-script.py script to C:\slave\test\build\venv\Scripts 08:35:30 INFO - Installing mozprofile.exe script to C:\slave\test\build\venv\Scripts 08:35:30 INFO - Installing diff-profiles-script.py script to C:\slave\test\build\venv\Scripts 08:35:30 INFO - Installing diff-profiles.exe script to C:\slave\test\build\venv\Scripts 08:35:30 INFO - Installing view-profile-script.py script to C:\slave\test\build\venv\Scripts 08:35:30 INFO - Installing view-profile.exe script to C:\slave\test\build\venv\Scripts 08:35:30 INFO - Running setup.py install for mozrunner 08:35:30 INFO - Installing mozrunner-script.py script to C:\slave\test\build\venv\Scripts 08:35:30 INFO - Installing mozrunner.exe script to C:\slave\test\build\venv\Scripts 08:35:30 INFO - Running setup.py install for mozscreenshot 08:35:30 INFO - Running setup.py install for moztest 08:35:30 INFO - Running setup.py install for mozversion 08:35:30 INFO - Installing mozversion-script.py script to C:\slave\test\build\venv\Scripts 08:35:30 INFO - Installing mozversion.exe script to C:\slave\test\build\venv\Scripts 08:35:31 INFO - Running setup.py install for wptserve 08:35:31 INFO - Successfully installed browsermob-proxy firefox-puppeteer manifestparser marionette-driver marionette-harness mozcrash mozdebug mozdevice mozfile mozhttpd mozinfo mozInstall mozleak mozlog moznetwork mozprocess mozprofile mozrunner mozscreenshot moztest mozversion wptserve 08:35:31 INFO - Cleaning up... 08:35:31 INFO - Return code: 0 08:35:31 INFO - Installing None into virtualenv C:\slave\test\build\venv 08:35:31 INFO - proxxy config: {'regions': ['.use1.', '.usw2.', '.scl3'], 'instances': ['proxxy1.srv.releng.use1.mozilla.com', 'proxxy1.srv.releng.usw2.mozilla.com', 'proxxy1.srv.releng.scl3.mozilla.com'], 'urls': [('http://ftp.mozilla.org', 'ftp.mozilla.org'), ('https://ftp.mozilla.org', 'ftp.mozilla.org'), ('https://ftp-ssl.mozilla.org', 'ftp.mozilla.org'), ('http://pypi.pvt.build.mozilla.org', 'pypi.pvt.build.mozilla.org'), ('http://pypi.pub.build.mozilla.org', 'pypi.pub.build.mozilla.org')]} 08:35:31 INFO - http://pypi.pvt.build.mozilla.org/pub matches http://pypi.pvt.build.mozilla.org 08:35:31 INFO - proxxy config: {'regions': ['.use1.', '.usw2.', '.scl3'], 'instances': ['proxxy1.srv.releng.use1.mozilla.com', 'proxxy1.srv.releng.usw2.mozilla.com', 'proxxy1.srv.releng.scl3.mozilla.com'], 'urls': [('http://ftp.mozilla.org', 'ftp.mozilla.org'), ('https://ftp.mozilla.org', 'ftp.mozilla.org'), ('https://ftp-ssl.mozilla.org', 'ftp.mozilla.org'), ('http://pypi.pvt.build.mozilla.org', 'pypi.pvt.build.mozilla.org'), ('http://pypi.pub.build.mozilla.org', 'pypi.pub.build.mozilla.org')]} 08:35:31 INFO - http://pypi.pub.build.mozilla.org/pub matches http://pypi.pub.build.mozilla.org 08:35:31 INFO - retry: Calling run_command with args: [['C:\\slave\\test\\build\\venv\\Scripts\\pip', 'install', '--timeout', '120', '-r', 'C:\\slave\\test\\build\\tests\\config\\marionette_requirements.txt', '--no-index', '--find-links', 'http://pypi.pvt.build.mozilla.org/pub', '--find-links', 'http://pypi.pub.build.mozilla.org/pub']], kwargs: {'error_level': 'warning', 'error_list': [{'substr': 'not found or a compiler error:', 'level': 'warning'}, {'regex': <_sre.SRE_Pattern object at 0x026CB250>, 'level': 'error'}, {'regex': <_sre.SRE_Pattern object at 0x026E0188>, 'level': 'warning'}, {'regex': <_sre.SRE_Pattern object at 0x02630048>, 'level': 'debug'}, {'substr': 'command not found', 'level': 'error'}, {'regex': <_sre.SRE_Pattern object at 0x01E18DE8>, 'level': 'warning'}, {'substr': 'Traceback (most recent call last)', 'level': 'error'}, {'substr': 'SyntaxError: ', 'level': 'error'}, {'substr': 'TypeError: ', 'level': 'error'}, {'substr': 'NameError: ', 'level': 'error'}, {'substr': 'ZeroDivisionError: ', 'level': 'error'}, {'regex': <_sre.SRE_Pattern object at 0x02604230>, 'level': 'critical'}, {'regex': <_sre.SRE_Pattern object at 0x026D4520>, 'level': 'critical'}], 'cwd': 'C:\\slave\\test\\build\\tests\\config', 'env': {'TMP': 'C:\\Users\\CLTBLD~1.T-W\\AppData\\Local\\Temp', 'TEST1': 'testie', 'COMPUTERNAME': 'T-W864-IX-303', 'USERDOMAIN': 'T-W864-IX-303', 'KTS_VERSION': '1.19c', 'PSMODULEPATH': 'C:\\windows\\system32\\WindowsPowerShell\\v1.0\\Modules\\', 'COMMONPROGRAMFILES': 'C:\\Program Files (x86)\\Common Files', 'PROCESSOR_IDENTIFIER': 'Intel64 Family 6 Model 30 Stepping 5, GenuineIntel', 'PROGRAMFILES': 'C:\\Program Files (x86)', 'PROCESSOR_REVISION': '1e05', 'DNSSUFFIX': 'wintest.releng.scl3.mozilla.com', 'SYSTEMROOT': 'C:\\windows', 'NO_EM_RESTART': '1', 'PROGRAMFILES(X86)': 'C:\\Program Files (x86)', 'OURDRIVE': 'C:', 'MOZ_HIDE_RESULTS_TABLE': '1', 'XPCOM_DEBUG_BREAK': 'warn', 'MONDIR': 'C:\\Monitor_config\\', 'TEMP': 'C:\\Users\\CLTBLD~1.T-W\\AppData\\Local\\Temp', 'COMMONPROGRAMFILES(X86)': 'C:\\Program Files (x86)\\Common Files', 'RUNLOGFILE': 'C:\\slave\\\\runslave.log', 'PROCESSOR_ARCHITECTURE': 'x86', 'ALLUSERSPROFILE': 'C:\\ProgramData', 'USERPROFILE': 'C:\\Users\\cltbld.T-W864-IX-303', 'LOCALAPPDATA': 'C:\\Users\\cltbld.T-W864-IX-303\\AppData\\Local', 'HOMEPATH': '\\Users\\cltbld.T-W864-IX-303', 'USERDOMAIN_ROAMINGPROFILE': 'T-W864-IX-303', 'MOZBUILDDIR': 'C:\\mozilla-build\\', 'PROGRAMW6432': 'C:\\Program Files', 'USERNAME': 'cltbld', 'LOGONSERVER': '\\\\T-W864-IX-303', 'MOZ_NO_REMOTE': '1', 'COMSPEC': 'C:\\windows\\system32\\cmd.exe', 'PROGRAMDATA': 'C:\\ProgramData', 'PROPERTIES_FILE': 'C:\\slave\\test/buildprops.json', 'PATH': 'C:\\Program Files (x86)\\NVIDIA Corporation\\PhysX\\Common;C:\\windows\\system32;C:\\windows;C:\\windows\\System32\\Wbem;C:\\windows\\System32\\WindowsPowerShell\\v1.0\\;C:\\mozilla-build\\python27;C:\\mozilla-build\\python27\\Scripts;C:\\mozilla-build\\msys\\bin;C:\\mozilla-build\\vim\\vim72;C:\\mozilla-build\\wget;C:\\mozilla-build\\info-zip;C:\\CoreUtils\\bin;C:\\mozilla-build\\buildbotve\\scripts;C:\\mozilla-build\\hg', 'PROMPT': '$P$G', 'NO_FAIL_ON_TEST_ERRORS': '1', 'PATHEXT': '.COM;.EXE;.BAT;.CMD;.VBS;.VBE;.JS;.JSE;.WSF;.WSH;.MSC', 'FP_NO_HOST_CHECK': 'NO', 'DCLOCATION': 'SCL3', 'APPDATA': 'C:\\Users\\cltbld.T-W864-IX-303\\AppData\\Roaming', 'HOMEDRIVE': 'C:', 'SYSTEMDRIVE': 'C:', 'SLAVEDIR': 'C:\\slave\\', 'NUMBER_OF_PROCESSORS': '8', 'PWD': 'C:\\slave\\test', 'PROCESSOR_LEVEL': '6', 'KTS_HOME': 'C:\\Program Files\\KTS', 'PROCESSOR_ARCHITEW6432': 'AMD64', 'MOZ_CRASHREPORTER_NO_REPORT': '1', 'COMMONPROGRAMW6432': 'C:\\Program Files\\Common Files', 'OS': 'Windows_NT', 'PUBLIC': 'C:\\Users\\Public', 'WINDIR': 'C:\\windows'}}, attempt #1 08:35:31 INFO - Running command: ['C:\\slave\\test\\build\\venv\\Scripts\\pip', 'install', '--timeout', '120', '-r', 'C:\\slave\\test\\build\\tests\\config\\marionette_requirements.txt', '--no-index', '--find-links', 'http://pypi.pvt.build.mozilla.org/pub', '--find-links', 'http://pypi.pub.build.mozilla.org/pub'] in C:\slave\test\build\tests\config 08:35:31 INFO - Copy/paste: C:\slave\test\build\venv\Scripts\pip install --timeout 120 -r C:\slave\test\build\tests\config\marionette_requirements.txt --no-index --find-links http://pypi.pvt.build.mozilla.org/pub --find-links http://pypi.pub.build.mozilla.org/pub 08:35:31 INFO - Using env: {'ALLUSERSPROFILE': 'C:\\ProgramData', 08:35:31 INFO - 'APPDATA': 'C:\\Users\\cltbld.T-W864-IX-303\\AppData\\Roaming', 08:35:31 INFO - 'COMMONPROGRAMFILES': 'C:\\Program Files (x86)\\Common Files', 08:35:31 INFO - 'COMMONPROGRAMFILES(X86)': 'C:\\Program Files (x86)\\Common Files', 08:35:31 INFO - 'COMMONPROGRAMW6432': 'C:\\Program Files\\Common Files', 08:35:31 INFO - 'COMPUTERNAME': 'T-W864-IX-303', 08:35:31 INFO - 'COMSPEC': 'C:\\windows\\system32\\cmd.exe', 08:35:31 INFO - 'DCLOCATION': 'SCL3', 08:35:31 INFO - 'DNSSUFFIX': 'wintest.releng.scl3.mozilla.com', 08:35:31 INFO - 'FP_NO_HOST_CHECK': 'NO', 08:35:31 INFO - 'HOMEDRIVE': 'C:', 08:35:31 INFO - 'HOMEPATH': '\\Users\\cltbld.T-W864-IX-303', 08:35:31 INFO - 'KTS_HOME': 'C:\\Program Files\\KTS', 08:35:31 INFO - 'KTS_VERSION': '1.19c', 08:35:31 INFO - 'LOCALAPPDATA': 'C:\\Users\\cltbld.T-W864-IX-303\\AppData\\Local', 08:35:31 INFO - 'LOGONSERVER': '\\\\T-W864-IX-303', 08:35:31 INFO - 'MONDIR': 'C:\\Monitor_config\\', 08:35:31 INFO - 'MOZBUILDDIR': 'C:\\mozilla-build\\', 08:35:31 INFO - 'MOZ_CRASHREPORTER_NO_REPORT': '1', 08:35:31 INFO - 'MOZ_HIDE_RESULTS_TABLE': '1', 08:35:31 INFO - 'MOZ_NO_REMOTE': '1', 08:35:31 INFO - 'NO_EM_RESTART': '1', 08:35:31 INFO - 'NO_FAIL_ON_TEST_ERRORS': '1', 08:35:31 INFO - 'NUMBER_OF_PROCESSORS': '8', 08:35:31 INFO - 'OS': 'Windows_NT', 08:35:31 INFO - 'OURDRIVE': 'C:', 08:35:31 INFO - 'PATH': 'C:\\Program Files (x86)\\NVIDIA Corporation\\PhysX\\Common;C:\\windows\\system32;C:\\windows;C:\\windows\\System32\\Wbem;C:\\windows\\System32\\WindowsPowerShell\\v1.0\\;C:\\mozilla-build\\python27;C:\\mozilla-build\\python27\\Scripts;C:\\mozilla-build\\msys\\bin;C:\\mozilla-build\\vim\\vim72;C:\\mozilla-build\\wget;C:\\mozilla-build\\info-zip;C:\\CoreUtils\\bin;C:\\mozilla-build\\buildbotve\\scripts;C:\\mozilla-build\\hg', 08:35:31 INFO - 'PATHEXT': '.COM;.EXE;.BAT;.CMD;.VBS;.VBE;.JS;.JSE;.WSF;.WSH;.MSC', 08:35:31 INFO - 'PROCESSOR_ARCHITECTURE': 'x86', 08:35:31 INFO - 'PROCESSOR_ARCHITEW6432': 'AMD64', 08:35:31 INFO - 'PROCESSOR_IDENTIFIER': 'Intel64 Family 6 Model 30 Stepping 5, GenuineIntel', 08:35:31 INFO - 'PROCESSOR_LEVEL': '6', 08:35:31 INFO - 'PROCESSOR_REVISION': '1e05', 08:35:31 INFO - 'PROGRAMDATA': 'C:\\ProgramData', 08:35:31 INFO - 'PROGRAMFILES': 'C:\\Program Files (x86)', 08:35:31 INFO - 'PROGRAMFILES(X86)': 'C:\\Program Files (x86)', 08:35:31 INFO - 'PROGRAMW6432': 'C:\\Program Files', 08:35:31 INFO - 'PROMPT': '$P$G', 08:35:31 INFO - 'PROPERTIES_FILE': 'C:\\slave\\test/buildprops.json', 08:35:31 INFO - 'PSMODULEPATH': 'C:\\windows\\system32\\WindowsPowerShell\\v1.0\\Modules\\', 08:35:31 INFO - 'PUBLIC': 'C:\\Users\\Public', 08:35:31 INFO - 'PWD': 'C:\\slave\\test', 08:35:31 INFO - 'RUNLOGFILE': 'C:\\slave\\\\runslave.log', 08:35:31 INFO - 'SLAVEDIR': 'C:\\slave\\', 08:35:31 INFO - 'SYSTEMDRIVE': 'C:', 08:35:31 INFO - 'SYSTEMROOT': 'C:\\windows', 08:35:31 INFO - 'TEMP': 'C:\\Users\\CLTBLD~1.T-W\\AppData\\Local\\Temp', 08:35:31 INFO - 'TEST1': 'testie', 08:35:31 INFO - 'TMP': 'C:\\Users\\CLTBLD~1.T-W\\AppData\\Local\\Temp', 08:35:31 INFO - 'USERDOMAIN': 'T-W864-IX-303', 08:35:31 INFO - 'USERDOMAIN_ROAMINGPROFILE': 'T-W864-IX-303', 08:35:31 INFO - 'USERNAME': 'cltbld', 08:35:31 INFO - 'USERPROFILE': 'C:\\Users\\cltbld.T-W864-IX-303', 08:35:31 INFO - 'WINDIR': 'C:\\windows', 08:35:31 INFO - 'XPCOM_DEBUG_BREAK': 'warn'} 08:35:33 INFO - Ignoring indexes: http://pypi.python.org/simple/ 08:35:33 INFO - Unpacking c:\slave\test\build\tests\mozbase\manifestparser 08:35:33 INFO - Running setup.py egg_info for package from file:///c%7C%5Cslave%5Ctest%5Cbuild%5Ctests%5Cmozbase%5Cmanifestparser 08:35:33 INFO - Unpacking c:\slave\test\build\tests\mozbase\mozcrash 08:35:33 INFO - Running setup.py egg_info for package from file:///c%7C%5Cslave%5Ctest%5Cbuild%5Ctests%5Cmozbase%5Cmozcrash 08:35:33 INFO - Unpacking c:\slave\test\build\tests\mozbase\mozdebug 08:35:33 INFO - Running setup.py egg_info for package from file:///c%7C%5Cslave%5Ctest%5Cbuild%5Ctests%5Cmozbase%5Cmozdebug 08:35:33 INFO - Unpacking c:\slave\test\build\tests\mozbase\mozdevice 08:35:33 INFO - Running setup.py egg_info for package from file:///c%7C%5Cslave%5Ctest%5Cbuild%5Ctests%5Cmozbase%5Cmozdevice 08:35:33 INFO - Unpacking c:\slave\test\build\tests\mozbase\mozfile 08:35:33 INFO - Running setup.py egg_info for package from file:///c%7C%5Cslave%5Ctest%5Cbuild%5Ctests%5Cmozbase%5Cmozfile 08:35:33 INFO - Unpacking c:\slave\test\build\tests\mozbase\mozhttpd 08:35:33 INFO - Running setup.py egg_info for package from file:///c%7C%5Cslave%5Ctest%5Cbuild%5Ctests%5Cmozbase%5Cmozhttpd 08:35:33 INFO - Unpacking c:\slave\test\build\tests\mozbase\mozinfo 08:35:33 INFO - Running setup.py egg_info for package from file:///c%7C%5Cslave%5Ctest%5Cbuild%5Ctests%5Cmozbase%5Cmozinfo 08:35:33 INFO - Unpacking c:\slave\test\build\tests\mozbase\mozinstall 08:35:33 INFO - Running setup.py egg_info for package from file:///c%7C%5Cslave%5Ctest%5Cbuild%5Ctests%5Cmozbase%5Cmozinstall 08:35:33 INFO - Unpacking c:\slave\test\build\tests\mozbase\mozleak 08:35:33 INFO - Running setup.py egg_info for package from file:///c%7C%5Cslave%5Ctest%5Cbuild%5Ctests%5Cmozbase%5Cmozleak 08:35:33 INFO - Unpacking c:\slave\test\build\tests\mozbase\mozlog 08:35:33 INFO - Running setup.py egg_info for package from file:///c%7C%5Cslave%5Ctest%5Cbuild%5Ctests%5Cmozbase%5Cmozlog 08:35:33 INFO - Unpacking c:\slave\test\build\tests\mozbase\moznetwork 08:35:33 INFO - Running setup.py egg_info for package from file:///c%7C%5Cslave%5Ctest%5Cbuild%5Ctests%5Cmozbase%5Cmoznetwork 08:35:33 INFO - Unpacking c:\slave\test\build\tests\mozbase\mozprocess 08:35:33 INFO - Running setup.py egg_info for package from file:///c%7C%5Cslave%5Ctest%5Cbuild%5Ctests%5Cmozbase%5Cmozprocess 08:35:33 INFO - Unpacking c:\slave\test\build\tests\mozbase\mozprofile 08:35:33 INFO - Running setup.py egg_info for package from file:///c%7C%5Cslave%5Ctest%5Cbuild%5Ctests%5Cmozbase%5Cmozprofile 08:35:33 INFO - Unpacking c:\slave\test\build\tests\mozbase\mozrunner 08:35:33 INFO - Running setup.py egg_info for package from file:///c%7C%5Cslave%5Ctest%5Cbuild%5Ctests%5Cmozbase%5Cmozrunner 08:35:33 INFO - Unpacking c:\slave\test\build\tests\mozbase\mozscreenshot 08:35:33 INFO - Running setup.py egg_info for package from file:///c%7C%5Cslave%5Ctest%5Cbuild%5Ctests%5Cmozbase%5Cmozscreenshot 08:35:33 INFO - Unpacking c:\slave\test\build\tests\mozbase\moztest 08:35:33 INFO - Running setup.py egg_info for package from file:///c%7C%5Cslave%5Ctest%5Cbuild%5Ctests%5Cmozbase%5Cmoztest 08:35:33 INFO - Unpacking c:\slave\test\build\tests\mozbase\mozversion 08:35:33 INFO - Running setup.py egg_info for package from file:///c%7C%5Cslave%5Ctest%5Cbuild%5Ctests%5Cmozbase%5Cmozversion 08:35:33 INFO - Unpacking c:\slave\test\build\tests\tools\wptserve 08:35:33 INFO - Running setup.py egg_info for package from file:///c%7C%5Cslave%5Ctest%5Cbuild%5Ctests%5Ctools%5Cwptserve 08:35:33 INFO - Unpacking c:\slave\test\build\tests\marionette\client 08:35:33 INFO - Running setup.py egg_info for package from file:///c%7C%5Cslave%5Ctest%5Cbuild%5Ctests%5Cmarionette%5Cclient 08:35:33 INFO - Unpacking c:\slave\test\build\tests\marionette\harness\marionette_harness\runner\mixins\browsermob-proxy-py 08:35:33 INFO - Running setup.py egg_info for package from file:///c%7C%5Cslave%5Ctest%5Cbuild%5Ctests%5Cmarionette%5Charness%5Cmarionette_harness%5Crunner%5Cmixins%5Cbrowsermob-proxy-py 08:35:33 INFO - Unpacking c:\slave\test\build\tests\marionette\harness 08:35:33 INFO - Running setup.py egg_info for package from file:///c%7C%5Cslave%5Ctest%5Cbuild%5Ctests%5Cmarionette%5Charness 08:35:33 INFO - Unpacking c:\slave\test\build\tests\marionette\puppeteer\firefox 08:35:33 INFO - Running setup.py egg_info for package from file:///c%7C%5Cslave%5Ctest%5Cbuild%5Ctests%5Cmarionette%5Cpuppeteer%5Cfirefox 08:35:42 INFO - Requirement already satisfied (use --upgrade to upgrade): mozfile>=1.0 in c:\slave\test\build\venv\lib\site-packages (from mozcrash->-r C:\slave\test\build\tests\config\mozbase_requirements.txt (line 2)) 08:35:42 INFO - Requirement already satisfied (use --upgrade to upgrade): mozlog>=3.0 in c:\slave\test\build\venv\lib\site-packages (from mozcrash->-r C:\slave\test\build\tests\config\mozbase_requirements.txt (line 2)) 08:35:42 INFO - Requirement already satisfied (use --upgrade to upgrade): mozinfo in c:\slave\test\build\venv\lib\site-packages (from mozdebug->-r C:\slave\test\build\tests\config\mozbase_requirements.txt (line 3)) 08:35:42 INFO - Requirement already satisfied (use --upgrade to upgrade): moznetwork>=0.24 in c:\slave\test\build\venv\lib\site-packages (from mozdevice->-r C:\slave\test\build\tests\config\mozbase_requirements.txt (line 4)) 08:35:42 INFO - Requirement already satisfied (use --upgrade to upgrade): mozprocess>=0.19 in c:\slave\test\build\venv\lib\site-packages (from mozdevice->-r C:\slave\test\build\tests\config\mozbase_requirements.txt (line 4)) 08:35:42 INFO - Downloading/unpacking blessings>=1.3 (from mozlog->-r C:\slave\test\build\tests\config\mozbase_requirements.txt (line 10)) 08:35:42 INFO - Downloading blessings-1.6.tar.gz 08:35:42 INFO - Running setup.py egg_info for package blessings 08:35:42 INFO - Requirement already satisfied (use --upgrade to upgrade): requests>=1.1.0 in c:\slave\test\build\venv\lib\site-packages (from browsermob-proxy->-r C:\slave\test\build\tests\config\marionette_requirements.txt (line 5)) 08:35:42 INFO - Installing collected packages: blessings, browsermob-proxy, firefox-puppeteer, manifestparser, marionette-driver, marionette-harness, mozcrash, mozdebug, mozdevice, mozhttpd, mozInstall, mozleak, mozprofile, mozrunner, mozscreenshot, moztest, mozversion, wptserve 08:35:42 INFO - Running setup.py install for blessings 08:35:42 INFO - Running setup.py install for browsermob-proxy 08:35:42 INFO - Running setup.py install for firefox-puppeteer 08:35:42 INFO - Running setup.py install for manifestparser 08:35:42 INFO - Installing manifestparser-script.py script to C:\slave\test\build\venv\Scripts 08:35:42 INFO - Installing manifestparser.exe script to C:\slave\test\build\venv\Scripts 08:35:42 INFO - Running setup.py install for marionette-driver 08:35:42 INFO - Running setup.py install for marionette-harness 08:35:42 INFO - Installing marionette-script.py script to C:\slave\test\build\venv\Scripts 08:35:42 INFO - Installing marionette.exe script to C:\slave\test\build\venv\Scripts 08:35:42 INFO - Running setup.py install for mozcrash 08:35:42 INFO - Running setup.py install for mozdebug 08:35:42 INFO - Running setup.py install for mozdevice 08:35:42 INFO - Installing sutini-script.py script to C:\slave\test\build\venv\Scripts 08:35:42 INFO - Installing sutini.exe script to C:\slave\test\build\venv\Scripts 08:35:42 INFO - Installing dm-script.py script to C:\slave\test\build\venv\Scripts 08:35:42 INFO - Installing dm.exe script to C:\slave\test\build\venv\Scripts 08:35:42 INFO - Running setup.py install for mozhttpd 08:35:42 INFO - Installing mozhttpd-script.py script to C:\slave\test\build\venv\Scripts 08:35:42 INFO - Installing mozhttpd.exe script to C:\slave\test\build\venv\Scripts 08:35:42 INFO - Running setup.py install for mozInstall 08:35:42 INFO - Installing moz_remove_from_system-script.py script to C:\slave\test\build\venv\Scripts 08:35:42 INFO - Installing moz_remove_from_system.exe script to C:\slave\test\build\venv\Scripts 08:35:42 INFO - Installing mozuninstall-script.py script to C:\slave\test\build\venv\Scripts 08:35:42 INFO - Installing mozuninstall.exe script to C:\slave\test\build\venv\Scripts 08:35:42 INFO - Installing mozinstall-script.py script to C:\slave\test\build\venv\Scripts 08:35:42 INFO - Installing mozinstall.exe script to C:\slave\test\build\venv\Scripts 08:35:42 INFO - Installing moz_add_to_system-script.py script to C:\slave\test\build\venv\Scripts 08:35:42 INFO - Installing moz_add_to_system.exe script to C:\slave\test\build\venv\Scripts 08:35:42 INFO - Running setup.py install for mozleak 08:35:42 INFO - Running setup.py install for mozprofile 08:35:42 INFO - Installing mozprofile-script.py script to C:\slave\test\build\venv\Scripts 08:35:42 INFO - Installing mozprofile.exe script to C:\slave\test\build\venv\Scripts 08:35:42 INFO - Installing diff-profiles-script.py script to C:\slave\test\build\venv\Scripts 08:35:42 INFO - Installing diff-profiles.exe script to C:\slave\test\build\venv\Scripts 08:35:42 INFO - Installing view-profile-script.py script to C:\slave\test\build\venv\Scripts 08:35:42 INFO - Installing view-profile.exe script to C:\slave\test\build\venv\Scripts 08:35:42 INFO - Running setup.py install for mozrunner 08:35:44 INFO - Installing mozrunner-script.py script to C:\slave\test\build\venv\Scripts 08:35:44 INFO - Installing mozrunner.exe script to C:\slave\test\build\venv\Scripts 08:35:44 INFO - Running setup.py install for mozscreenshot 08:35:44 INFO - Running setup.py install for moztest 08:35:44 INFO - Running setup.py install for mozversion 08:35:44 INFO - Installing mozversion-script.py script to C:\slave\test\build\venv\Scripts 08:35:44 INFO - Installing mozversion.exe script to C:\slave\test\build\venv\Scripts 08:35:44 INFO - Running setup.py install for wptserve 08:35:44 INFO - Successfully installed blessings browsermob-proxy firefox-puppeteer manifestparser marionette-driver marionette-harness mozcrash mozdebug mozdevice mozhttpd mozInstall mozleak mozprofile mozrunner mozscreenshot moztest mozversion wptserve 08:35:44 INFO - Cleaning up... 08:35:44 INFO - Return code: 0 08:35:44 INFO - Done creating virtualenv C:\slave\test\build\venv. 08:35:44 INFO - Getting output from command: ['C:\\slave\\test\\build\\venv\\Scripts\\pip', 'freeze'] 08:35:44 INFO - Copy/paste: C:\slave\test\build\venv\Scripts\pip freeze 08:35:45 INFO - Reading from file tmpfile_stdout 08:35:45 INFO - Using _rmtree_windows ... 08:35:45 INFO - Using _rmtree_windows ... 08:35:45 INFO - Current package versions: 08:35:45 INFO - blessings == 1.6 08:35:45 INFO - blobuploader == 1.2.4 08:35:45 INFO - browsermob-proxy == 0.6.0 08:35:45 INFO - distribute == 0.6.14 08:35:45 INFO - docopt == 0.6.1 08:35:45 INFO - firefox-puppeteer == 52.1.0 08:35:45 INFO - functools32 == 3.2.3-2 08:35:45 INFO - jsonschema == 2.5.1 08:35:45 INFO - manifestparser == 1.1 08:35:45 INFO - marionette-driver == 2.2.0 08:35:45 INFO - marionette-harness == 4.0.0 08:35:45 INFO - mozInstall == 1.12 08:35:45 INFO - mozcrash == 1.0 08:35:45 INFO - mozdebug == 0.1 08:35:45 INFO - mozdevice == 0.48 08:35:45 INFO - mozfile == 1.2 08:35:45 INFO - mozhttpd == 0.7 08:35:45 INFO - mozinfo == 0.9 08:35:45 INFO - mozleak == 0.1 08:35:45 INFO - mozlog == 3.4 08:35:45 INFO - moznetwork == 0.27 08:35:45 INFO - mozprocess == 0.23 08:35:45 INFO - mozprofile == 0.28 08:35:45 INFO - mozrunner == 6.13 08:35:45 INFO - mozscreenshot == 0.1 08:35:45 INFO - mozsystemmonitor == 0.3 08:35:45 INFO - moztest == 0.7 08:35:45 INFO - mozversion == 1.4 08:35:45 INFO - requests == 1.2.3 08:35:45 INFO - wptserve == 1.4.0 08:35:45 INFO - Running post-action listener: _resource_record_post_action 08:35:45 INFO - Running post-action listener: _start_resource_monitoring 08:35:45 INFO - Starting resource monitoring. 08:35:45 INFO - [mozharness: 2016-12-22 16:35:45.136000Z] Finished create-virtualenv step (success) 08:35:45 INFO - [mozharness: 2016-12-22 16:35:45.136000Z] Running pull step. 08:35:45 INFO - Running pre-action listener: _resource_record_pre_action 08:35:45 INFO - Running main action method: pull 08:35:45 INFO - Pull has nothing to do! 08:35:45 INFO - Running post-action listener: _resource_record_post_action 08:35:45 INFO - [mozharness: 2016-12-22 16:35:45.137000Z] Finished pull step (success) 08:35:45 INFO - [mozharness: 2016-12-22 16:35:45.137000Z] Running install step. 08:35:45 INFO - Running pre-action listener: _resource_record_pre_action 08:35:45 INFO - Running main action method: install 08:35:45 INFO - Getting output from command: ['C:\\slave\\test\\build\\venv\\Scripts\\pip', 'freeze'] 08:35:45 INFO - Copy/paste: C:\slave\test\build\venv\Scripts\pip freeze 08:35:45 INFO - Reading from file tmpfile_stdout 08:35:45 INFO - Using _rmtree_windows ... 08:35:45 INFO - Using _rmtree_windows ... 08:35:45 INFO - Detecting whether we're running mozinstall >=1.0... 08:35:45 INFO - Getting output from command: ['C:\\slave\\test/build/venv/scripts/python', 'C:\\slave\\test/build/venv/scripts/mozinstall-script.py', '-h'] 08:35:45 INFO - Copy/paste: C:\slave\test/build/venv/scripts/python C:\slave\test/build/venv/scripts/mozinstall-script.py -h 08:35:45 INFO - Reading from file tmpfile_stdout 08:35:45 INFO - Output received: 08:35:45 INFO - Usage: mozinstall-script.py [options] installer 08:35:45 INFO - Options: 08:35:45 INFO - -h, --help show this help message and exit 08:35:45 INFO - -d DEST, --destination=DEST 08:35:45 INFO - Directory to install application into. [default: 08:35:45 INFO - "C:\slave\test"] 08:35:45 INFO - --app=APP Application being installed. [default: firefox] 08:35:45 INFO - Using _rmtree_windows ... 08:35:45 INFO - Using _rmtree_windows ... 08:35:45 INFO - mkdir: C:\slave\test\build\application 08:35:45 INFO - Getting output from command: ['C:\\slave\\test/build/venv/scripts/python', 'C:\\slave\\test/build/venv/scripts/mozinstall-script.py', 'C:\\slave\\test\\build\\firefox-52.0a2.en-US.win64.zip', '--destination', 'C:\\slave\\test\\build\\application'] 08:35:45 INFO - Copy/paste: C:\slave\test/build/venv/scripts/python C:\slave\test/build/venv/scripts/mozinstall-script.py C:\slave\test\build\firefox-52.0a2.en-US.win64.zip --destination C:\slave\test\build\application ProcessManager NOT managing child processes 08:35:47 INFO - Reading from file tmpfile_stdout 08:35:47 INFO - Output received: 08:35:47 INFO - C:\slave\test\build\application\firefox\firefox.exe 08:35:47 INFO - Using _rmtree_windows ... 08:35:47 INFO - Using _rmtree_windows ... 08:35:47 INFO - Running post-action listener: _resource_record_post_action 08:35:47 INFO - [mozharness: 2016-12-22 16:35:47.918000Z] Finished install step (success) 08:35:47 INFO - [mozharness: 2016-12-22 16:35:47.918000Z] Running run-tests step. 08:35:47 INFO - Running pre-action listener: _resource_record_pre_action 08:35:47 INFO - Running main action method: run_tests 08:35:47 INFO - mkdir: C:\slave\test\build\blobber_upload_dir 08:35:47 INFO - Minidump filename unknown. Determining based upon platform and architecture. 08:35:47 INFO - Minidump tooltool manifest unknown. Determining based upon platform and architecture. 08:35:47 INFO - grabbing minidump binary from tooltool 08:35:47 INFO - proxxy config: {'regions': ['.use1.', '.usw2.', '.scl3'], 'instances': ['proxxy1.srv.releng.use1.mozilla.com', 'proxxy1.srv.releng.usw2.mozilla.com', 'proxxy1.srv.releng.scl3.mozilla.com'], 'urls': [('http://ftp.mozilla.org', 'ftp.mozilla.org'), ('https://ftp.mozilla.org', 'ftp.mozilla.org'), ('https://ftp-ssl.mozilla.org', 'ftp.mozilla.org'), ('http://pypi.pvt.build.mozilla.org', 'pypi.pvt.build.mozilla.org'), ('http://pypi.pub.build.mozilla.org', 'pypi.pub.build.mozilla.org')]} 08:35:47 INFO - retry: Calling run_command with args: (['c:\\mozilla-build\\python27\\python.exe', 'C:/mozilla-build/tooltool.py', '--url', 'https://api.pub.build.mozilla.org/tooltool/', '--authentication-file', 'c:\\builds\\relengapi.tok', 'fetch', '-m', 'C:\\slave\\test\\build\\tests\\config/tooltool-manifests/win32/releng.manifest', '-o'],), kwargs: {'output_timeout': 600, 'error_list': [{'substr': 'command not found', 'level': 'error'}, {'regex': <_sre.SRE_Pattern object at 0x01E18DE8>, 'level': 'warning'}, {'substr': 'Traceback (most recent call last)', 'level': 'error'}, {'substr': 'SyntaxError: ', 'level': 'error'}, {'substr': 'TypeError: ', 'level': 'error'}, {'substr': 'NameError: ', 'level': 'error'}, {'substr': 'ZeroDivisionError: ', 'level': 'error'}, {'regex': <_sre.SRE_Pattern object at 0x02604230>, 'level': 'critical'}, {'regex': <_sre.SRE_Pattern object at 0x026D4520>, 'level': 'critical'}, {'substr': 'ERROR - ', 'level': 'error'}], 'cwd': 'C:\\slave\\test\\build', 'privileged': False}, attempt #1 08:35:47 INFO - Running command: ['c:\\mozilla-build\\python27\\python.exe', 'C:/mozilla-build/tooltool.py', '--url', 'https://api.pub.build.mozilla.org/tooltool/', '--authentication-file', 'c:\\builds\\relengapi.tok', 'fetch', '-m', 'C:\\slave\\test\\build\\tests\\config/tooltool-manifests/win32/releng.manifest', '-o'] in C:\slave\test\build 08:35:47 INFO - Copy/paste: c:\mozilla-build\python27\python.exe C:/mozilla-build/tooltool.py --url https://api.pub.build.mozilla.org/tooltool/ --authentication-file c:\builds\relengapi.tok fetch -m C:\slave\test\build\tests\config/tooltool-manifests/win32/releng.manifest -o 08:35:47 INFO - Calling ['c:\\mozilla-build\\python27\\python.exe', 'C:/mozilla-build/tooltool.py', '--url', 'https://api.pub.build.mozilla.org/tooltool/', '--authentication-file', 'c:\\builds\\relengapi.tok', 'fetch', '-m', 'C:\\slave\\test\\build\\tests\\config/tooltool-manifests/win32/releng.manifest', '-o'] with output_timeout 600 ProcessManager UNABLE to use job objects to manage child processes 08:35:47 INFO - INFO - Attempting to fetch from 'https://api.pub.build.mozilla.org/tooltool/'... 08:35:48 INFO - INFO - File win32-minidump_stackwalk.exe fetched from https://api.pub.build.mozilla.org/tooltool/ as C:\slave\test\build\tmphwbqnk 08:35:48 INFO - INFO - File integrity verified, renaming tmphwbqnk to win32-minidump_stackwalk.exe 08:35:48 INFO - Return code: 0 08:35:48 INFO - Chmoding C:\slave\test\build\win32-minidump_stackwalk.exe to 0755 08:35:49 INFO - ENV: MINIDUMP_SAVE_PATH is now C:\slave\test\build\blobber_upload_dir 08:35:49 INFO - Running command: ['C:\\slave\\test\\build\\venv\\Scripts\\python', '-u', 'C:\\slave\\test\\build\\tests\\web-platform\\runtests.py', '--log-raw=-', '--log-raw=C:\\slave\\test\\build\\blobber_upload_dir\\wpt_raw.log', '--log-errorsummary=C:\\slave\\test\\build\\blobber_upload_dir\\wpt_errorsummary.log', '--binary=C:\\slave\\test\\build\\application\\firefox\\firefox.exe', '--symbols-path=https://queue.taskcluster.net/v1/task/BGboJK_ERvKTPFUls4AHYA/artifacts/public/build/firefox-52.0a2.en-US.win64.crashreporter-symbols.zip', '--stackwalk-binary=C:\\slave\\test\\build\\win32-minidump_stackwalk.exe', '--stackfix-dir=C:\\slave\\test\\build\\tests\\bin', '--test-type=testharness', '--disable-e10s', '--total-chunks=10', '--this-chunk=2', '--prefs-root=C:\\slave\\test\\build\\tests\\web-platform/prefs', '--processes=1', '--config=C:\\slave\\test\\build\\tests\\web-platform/wptrunner.ini', '--ca-cert-path=C:\\slave\\test\\build\\tests\\web-platform/certs/cacert.pem', '--host-key-path=C:\\slave\\test\\build\\tests\\web-platform/certs/web-platform.test.key', '--host-cert-path=C:\\slave\\test\\build\\tests\\web-platform/certs/web-platform.test.pem', '--certutil-binary=C:\\slave\\test\\build\\tests/bin/certutil'] in C:\slave\test\build 08:35:49 INFO - Copy/paste: C:\slave\test\build\venv\Scripts\python -u C:\slave\test\build\tests\web-platform\runtests.py --log-raw=- --log-raw=C:\slave\test\build\blobber_upload_dir\wpt_raw.log --log-errorsummary=C:\slave\test\build\blobber_upload_dir\wpt_errorsummary.log --binary=C:\slave\test\build\application\firefox\firefox.exe --symbols-path=https://queue.taskcluster.net/v1/task/BGboJK_ERvKTPFUls4AHYA/artifacts/public/build/firefox-52.0a2.en-US.win64.crashreporter-symbols.zip --stackwalk-binary=C:\slave\test\build\win32-minidump_stackwalk.exe --stackfix-dir=C:\slave\test\build\tests\bin --test-type=testharness --disable-e10s --total-chunks=10 --this-chunk=2 --prefs-root=C:\slave\test\build\tests\web-platform/prefs --processes=1 --config=C:\slave\test\build\tests\web-platform/wptrunner.ini --ca-cert-path=C:\slave\test\build\tests\web-platform/certs/cacert.pem --host-key-path=C:\slave\test\build\tests\web-platform/certs/web-platform.test.key --host-cert-path=C:\slave\test\build\tests\web-platform/certs/web-platform.test.pem --certutil-binary=C:\slave\test\build\tests/bin/certutil 08:35:49 INFO - Using env: {'ALLUSERSPROFILE': 'C:\\ProgramData', 08:35:49 INFO - 'APPDATA': 'C:\\Users\\cltbld.T-W864-IX-303\\AppData\\Roaming', 08:35:49 INFO - 'COMMONPROGRAMFILES': 'C:\\Program Files (x86)\\Common Files', 08:35:49 INFO - 'COMMONPROGRAMFILES(X86)': 'C:\\Program Files (x86)\\Common Files', 08:35:49 INFO - 'COMMONPROGRAMW6432': 'C:\\Program Files\\Common Files', 08:35:49 INFO - 'COMPUTERNAME': 'T-W864-IX-303', 08:35:49 INFO - 'COMSPEC': 'C:\\windows\\system32\\cmd.exe', 08:35:49 INFO - 'DCLOCATION': 'SCL3', 08:35:49 INFO - 'DNSSUFFIX': 'wintest.releng.scl3.mozilla.com', 08:35:49 INFO - 'FP_NO_HOST_CHECK': 'NO', 08:35:49 INFO - 'HOMEDRIVE': 'C:', 08:35:49 INFO - 'HOMEPATH': '\\Users\\cltbld.T-W864-IX-303', 08:35:49 INFO - 'KTS_HOME': 'C:\\Program Files\\KTS', 08:35:49 INFO - 'KTS_VERSION': '1.19c', 08:35:49 INFO - 'LOCALAPPDATA': 'C:\\Users\\cltbld.T-W864-IX-303\\AppData\\Local', 08:35:49 INFO - 'LOGONSERVER': '\\\\T-W864-IX-303', 08:35:49 INFO - 'MINIDUMP_SAVE_PATH': 'C:\\slave\\test\\build\\blobber_upload_dir', 08:35:49 INFO - 'MONDIR': 'C:\\Monitor_config\\', 08:35:49 INFO - 'MOZBUILDDIR': 'C:\\mozilla-build\\', 08:35:49 INFO - 'MOZ_CRASHREPORTER_NO_REPORT': '1', 08:35:49 INFO - 'MOZ_HIDE_RESULTS_TABLE': '1', 08:35:49 INFO - 'MOZ_NO_REMOTE': '1', 08:35:49 INFO - 'NO_EM_RESTART': '1', 08:35:49 INFO - 'NO_FAIL_ON_TEST_ERRORS': '1', 08:35:49 INFO - 'NUMBER_OF_PROCESSORS': '8', 08:35:49 INFO - 'OS': 'Windows_NT', 08:35:49 INFO - 'OURDRIVE': 'C:', 08:35:49 INFO - 'PATH': 'C:\\Program Files (x86)\\NVIDIA Corporation\\PhysX\\Common;C:\\windows\\system32;C:\\windows;C:\\windows\\System32\\Wbem;C:\\windows\\System32\\WindowsPowerShell\\v1.0\\;C:\\mozilla-build\\python27;C:\\mozilla-build\\python27\\Scripts;C:\\mozilla-build\\msys\\bin;C:\\mozilla-build\\vim\\vim72;C:\\mozilla-build\\wget;C:\\mozilla-build\\info-zip;C:\\CoreUtils\\bin;C:\\mozilla-build\\buildbotve\\scripts;C:\\mozilla-build\\hg', 08:35:49 INFO - 'PATHEXT': '.COM;.EXE;.BAT;.CMD;.VBS;.VBE;.JS;.JSE;.WSF;.WSH;.MSC', 08:35:49 INFO - 'PROCESSOR_ARCHITECTURE': 'x86', 08:35:49 INFO - 'PROCESSOR_ARCHITEW6432': 'AMD64', 08:35:49 INFO - 'PROCESSOR_IDENTIFIER': 'Intel64 Family 6 Model 30 Stepping 5, GenuineIntel', 08:35:49 INFO - 'PROCESSOR_LEVEL': '6', 08:35:49 INFO - 'PROCESSOR_REVISION': '1e05', 08:35:49 INFO - 'PROGRAMDATA': 'C:\\ProgramData', 08:35:49 INFO - 'PROGRAMFILES': 'C:\\Program Files (x86)', 08:35:49 INFO - 'PROGRAMFILES(X86)': 'C:\\Program Files (x86)', 08:35:49 INFO - 'PROGRAMW6432': 'C:\\Program Files', 08:35:49 INFO - 'PROMPT': '$P$G', 08:35:49 INFO - 'PROPERTIES_FILE': 'C:\\slave\\test/buildprops.json', 08:35:49 INFO - 'PSMODULEPATH': 'C:\\windows\\system32\\WindowsPowerShell\\v1.0\\Modules\\', 08:35:49 INFO - 'PUBLIC': 'C:\\Users\\Public', 08:35:49 INFO - 'PWD': 'C:\\slave\\test', 08:35:49 INFO - 'RUNLOGFILE': 'C:\\slave\\\\runslave.log', 08:35:49 INFO - 'SLAVEDIR': 'C:\\slave\\', 08:35:49 INFO - 'SYSTEMDRIVE': 'C:', 08:35:49 INFO - 'SYSTEMROOT': 'C:\\windows', 08:35:49 INFO - 'TEMP': 'C:\\Users\\CLTBLD~1.T-W\\AppData\\Local\\Temp', 08:35:49 INFO - 'TEST1': 'testie', 08:35:49 INFO - 'TMP': 'C:\\Users\\CLTBLD~1.T-W\\AppData\\Local\\Temp', 08:35:49 INFO - 'USERDOMAIN': 'T-W864-IX-303', 08:35:49 INFO - 'USERDOMAIN_ROAMINGPROFILE': 'T-W864-IX-303', 08:35:49 INFO - 'USERNAME': 'cltbld', 08:35:49 INFO - 'USERPROFILE': 'C:\\Users\\cltbld.T-W864-IX-303', 08:35:49 INFO - 'WINDIR': 'C:\\windows', 08:35:49 INFO - 'XPCOM_DEBUG_BREAK': 'warn'} 08:35:49 INFO - Calling ['C:\\slave\\test\\build\\venv\\Scripts\\python', '-u', 'C:\\slave\\test\\build\\tests\\web-platform\\runtests.py', '--log-raw=-', '--log-raw=C:\\slave\\test\\build\\blobber_upload_dir\\wpt_raw.log', '--log-errorsummary=C:\\slave\\test\\build\\blobber_upload_dir\\wpt_errorsummary.log', '--binary=C:\\slave\\test\\build\\application\\firefox\\firefox.exe', '--symbols-path=https://queue.taskcluster.net/v1/task/BGboJK_ERvKTPFUls4AHYA/artifacts/public/build/firefox-52.0a2.en-US.win64.crashreporter-symbols.zip', '--stackwalk-binary=C:\\slave\\test\\build\\win32-minidump_stackwalk.exe', '--stackfix-dir=C:\\slave\\test\\build\\tests\\bin', '--test-type=testharness', '--disable-e10s', '--total-chunks=10', '--this-chunk=2', '--prefs-root=C:\\slave\\test\\build\\tests\\web-platform/prefs', '--processes=1', '--config=C:\\slave\\test\\build\\tests\\web-platform/wptrunner.ini', '--ca-cert-path=C:\\slave\\test\\build\\tests\\web-platform/certs/cacert.pem', '--host-key-path=C:\\slave\\test\\build\\tests\\web-platform/certs/web-platform.test.key', '--host-cert-path=C:\\slave\\test\\build\\tests\\web-platform/certs/web-platform.test.pem', '--certutil-binary=C:\\slave\\test\\build\\tests/bin/certutil'] with output_timeout 1000 ProcessManager NOT managing child processes ProcessManager UNABLE to use job objects to manage child processes 08:35:51 INFO - STDERR: C:\slave\test\build\venv\lib\site-packages\mozrunner\utils.py:18: UserWarning: Module wptserve was already imported from C:\slave\test\build\tests\web-platform\tests\tools\wptserve\wptserve\__init__.py, but c:\slave\test\build\venv\lib\site-packages is being added to sys.path 08:35:51 INFO - import pkg_resources 08:35:51 INFO - STDERR: Opening manifest at C:\slave\test\build\tests\web-platform\meta\MANIFEST.json 08:35:51 INFO - STDERR: Opening manifest at C:\slave\test\build\tests\web-platform\mozilla\meta\MANIFEST.json 08:35:52 INFO - Using 1 client processes 08:35:54 INFO - SUITE-START | Running 704 tests 08:35:54 INFO - Running testharness tests 08:35:54 INFO - TEST-START | /content-security-policy/blink-contrib/self-doesnt-match-blob.sub.html 08:35:54 INFO - TEST-SKIP | /content-security-policy/blink-contrib/self-doesnt-match-blob.sub.html | took 0ms 08:35:54 INFO - TEST-START | /content-security-policy/blink-contrib/star-doesnt-match-blob.sub.html 08:35:54 INFO - TEST-SKIP | /content-security-policy/blink-contrib/star-doesnt-match-blob.sub.html | took 0ms 08:35:54 INFO - TEST-START | /content-security-policy/blink-contrib/worker-connect-src-allowed.sub.html 08:35:54 INFO - TEST-SKIP | /content-security-policy/blink-contrib/worker-connect-src-allowed.sub.html | took 1ms 08:35:54 INFO - TEST-START | /content-security-policy/blink-contrib/worker-script-src.sub.html 08:35:54 INFO - TEST-SKIP | /content-security-policy/blink-contrib/worker-script-src.sub.html | took 0ms 08:35:54 INFO - TEST-START | /custom-elements/v0/custom-element-lifecycle/types-of-callbacks/attached-callback-move-element-test.html 08:35:54 INFO - TEST-SKIP | /custom-elements/v0/custom-element-lifecycle/types-of-callbacks/attached-callback-move-element-test.html | took 0ms 08:35:54 INFO - TEST-START | /custom-elements/v0/custom-element-lifecycle/types-of-callbacks/attached-callback-test.html 08:35:54 INFO - TEST-SKIP | /custom-elements/v0/custom-element-lifecycle/types-of-callbacks/attached-callback-test.html | took 0ms 08:35:54 INFO - TEST-START | /custom-elements/v0/custom-element-lifecycle/types-of-callbacks/attribute-changed-callback-change-attribute-test.html 08:35:54 INFO - TEST-SKIP | /custom-elements/v0/custom-element-lifecycle/types-of-callbacks/attribute-changed-callback-change-attribute-test.html | took 0ms 08:35:54 INFO - TEST-START | /custom-elements/v0/custom-element-lifecycle/types-of-callbacks/attribute-changed-callback-remove-attribute-test.html 08:35:54 INFO - TEST-SKIP | /custom-elements/v0/custom-element-lifecycle/types-of-callbacks/attribute-changed-callback-remove-attribute-test.html | took 0ms 08:35:54 INFO - TEST-START | /custom-elements/v0/custom-element-lifecycle/types-of-callbacks/attribute-changed-callback-set-attribute-test.html 08:35:54 INFO - TEST-SKIP | /custom-elements/v0/custom-element-lifecycle/types-of-callbacks/attribute-changed-callback-set-attribute-test.html | took 1ms 08:35:54 INFO - TEST-START | /custom-elements/v0/custom-element-lifecycle/types-of-callbacks/created-callback-element-prototype-test.html 08:35:54 INFO - TEST-SKIP | /custom-elements/v0/custom-element-lifecycle/types-of-callbacks/created-callback-element-prototype-test.html | took 0ms 08:35:54 INFO - TEST-START | /custom-elements/v0/custom-element-lifecycle/types-of-callbacks/created-callback-invocation-order-test.html 08:35:54 INFO - TEST-SKIP | /custom-elements/v0/custom-element-lifecycle/types-of-callbacks/created-callback-invocation-order-test.html | took 0ms 08:35:54 INFO - TEST-START | /custom-elements/v0/custom-element-lifecycle/types-of-callbacks/created-callback-invocation-test.html 08:35:54 INFO - TEST-SKIP | /custom-elements/v0/custom-element-lifecycle/types-of-callbacks/created-callback-invocation-test.html | took 0ms 08:35:54 INFO - TEST-START | /custom-elements/v0/custom-element-lifecycle/types-of-callbacks/detached-callback-move-element-test.html 08:35:54 INFO - TEST-SKIP | /custom-elements/v0/custom-element-lifecycle/types-of-callbacks/detached-callback-move-element-test.html | took 1ms 08:35:54 INFO - TEST-START | /custom-elements/v0/custom-element-lifecycle/types-of-callbacks/detached-callback-no-browsing-context-test.html 08:35:54 INFO - TEST-SKIP | /custom-elements/v0/custom-element-lifecycle/types-of-callbacks/detached-callback-no-browsing-context-test.html | took 0ms 08:35:54 INFO - TEST-START | /custom-elements/v0/custom-element-lifecycle/types-of-callbacks/detached-callback-with-browsing-context-test.html 08:35:54 INFO - TEST-SKIP | /custom-elements/v0/custom-element-lifecycle/types-of-callbacks/detached-callback-with-browsing-context-test.html | took 1ms 08:35:54 INFO - TEST-START | /custom-elements/v0/instantiating/changing-is-attribute.html 08:35:54 INFO - TEST-SKIP | /custom-elements/v0/instantiating/changing-is-attribute.html | took 0ms 08:35:54 INFO - TEST-START | /custom-elements/v0/instantiating/custom-element-constructor-is-attribute.html 08:35:54 INFO - TEST-SKIP | /custom-elements/v0/instantiating/custom-element-constructor-is-attribute.html | took 1ms 08:35:54 INFO - TEST-START | /custom-elements/v0/instantiating/custom-element-constructor-local-name.html 08:35:54 INFO - TEST-SKIP | /custom-elements/v0/instantiating/custom-element-constructor-local-name.html | took 0ms 08:35:54 INFO - TEST-START | /custom-elements/v0/instantiating/custom-element-constructor-namespace.html 08:35:54 INFO - TEST-SKIP | /custom-elements/v0/instantiating/custom-element-constructor-namespace.html | took 1ms 08:35:54 INFO - TEST-START | /custom-elements/v0/instantiating/custom-element-constructor-node-document.html 08:35:54 INFO - TEST-SKIP | /custom-elements/v0/instantiating/custom-element-constructor-node-document.html | took 0ms 08:35:54 INFO - TEST-START | /custom-elements/v0/instantiating/custom-element-constructor-prototype.html 08:35:54 INFO - TEST-SKIP | /custom-elements/v0/instantiating/custom-element-constructor-prototype.html | took 1ms 08:35:54 INFO - TEST-START | /custom-elements/v0/instantiating/custom-element-prototype.html 08:35:54 INFO - TEST-SKIP | /custom-elements/v0/instantiating/custom-element-prototype.html | took 0ms 08:35:54 INFO - TEST-START | /custom-elements/v0/instantiating/custom-element-type-is-attribute.html 08:35:54 INFO - TEST-SKIP | /custom-elements/v0/instantiating/custom-element-type-is-attribute.html | took 1ms 08:35:54 INFO - TEST-START | /custom-elements/v0/instantiating/custom-element-type-local-name-and-is-attribute.html 08:35:54 INFO - TEST-SKIP | /custom-elements/v0/instantiating/custom-element-type-local-name-and-is-attribute.html | took 0ms 08:35:54 INFO - TEST-START | /custom-elements/v0/instantiating/custom-element-type-local-name.html 08:35:54 INFO - TEST-SKIP | /custom-elements/v0/instantiating/custom-element-type-local-name.html | took 1ms 08:35:54 INFO - TEST-START | /custom-elements/v0/instantiating/non-configurable-constructor-property.html 08:35:54 INFO - TEST-SKIP | /custom-elements/v0/instantiating/non-configurable-constructor-property.html | took 0ms 08:35:54 INFO - TEST-START | /custom-elements/v0/instantiating/prototype-is-interface-prototype-object.html 08:35:54 INFO - TEST-SKIP | /custom-elements/v0/instantiating/prototype-is-interface-prototype-object.html | took 0ms 08:35:54 INFO - TEST-START | /custom-elements/v0/instantiating/unchanged-attribute.html 08:35:54 INFO - TEST-SKIP | /custom-elements/v0/instantiating/unchanged-attribute.html | took 1ms 08:35:54 INFO - TEST-START | /mixed-content/blockable/http-csp/cross-origin-http/form-tag/top-level/keep-scheme-redirect/opt-in-blocks.https.html 08:35:54 INFO - TEST-SKIP | /mixed-content/blockable/http-csp/cross-origin-http/form-tag/top-level/keep-scheme-redirect/opt-in-blocks.https.html | took 1ms 08:35:54 INFO - TEST-START | /referrer-policy/no-referrer-when-downgrade/meta-referrer/same-origin/http-http/img-tag/insecure-protocol.keep-origin-redirect.http.html 08:35:54 INFO - TEST-SKIP | /referrer-policy/no-referrer-when-downgrade/meta-referrer/same-origin/http-http/img-tag/insecure-protocol.keep-origin-redirect.http.html | took 1ms 08:35:54 INFO - TEST-START | /referrer-policy/no-referrer-when-downgrade/meta-referrer/same-origin/http-http/img-tag/insecure-protocol.no-redirect.http.html 08:35:54 INFO - TEST-SKIP | /referrer-policy/no-referrer-when-downgrade/meta-referrer/same-origin/http-http/img-tag/insecure-protocol.no-redirect.http.html | took 1ms 08:35:54 INFO - TEST-START | /referrer-policy/no-referrer-when-downgrade/meta-referrer/same-origin/http-http/img-tag/insecure-protocol.swap-origin-redirect.http.html 08:35:54 INFO - TEST-SKIP | /referrer-policy/no-referrer-when-downgrade/meta-referrer/same-origin/http-http/img-tag/insecure-protocol.swap-origin-redirect.http.html | took 1ms 08:35:54 INFO - TEST-START | /referrer-policy/unsafe-url/meta-referrer/cross-origin/http-http/img-tag/generic.keep-origin-redirect.http.html 08:35:54 INFO - TEST-SKIP | /referrer-policy/unsafe-url/meta-referrer/cross-origin/http-http/img-tag/generic.keep-origin-redirect.http.html | took 1ms 08:35:54 INFO - TEST-START | /referrer-policy/unsafe-url/meta-referrer/cross-origin/http-http/img-tag/generic.no-redirect.http.html 08:35:54 INFO - TEST-SKIP | /referrer-policy/unsafe-url/meta-referrer/cross-origin/http-http/img-tag/generic.no-redirect.http.html | took 1ms 08:35:54 INFO - TEST-START | /referrer-policy/unsafe-url/meta-referrer/cross-origin/http-http/img-tag/generic.swap-origin-redirect.http.html 08:35:54 INFO - TEST-SKIP | /referrer-policy/unsafe-url/meta-referrer/cross-origin/http-http/img-tag/generic.swap-origin-redirect.http.html | took 0ms 08:35:54 INFO - TEST-START | /webgl/conformance-1.0.3/conformance/glsl/implicit/add_int_float.vert.html 08:35:54 INFO - TEST-SKIP | /webgl/conformance-1.0.3/conformance/glsl/implicit/add_int_float.vert.html | took 1ms 08:35:54 INFO - TEST-START | /webgl/conformance-1.0.3/conformance/glsl/implicit/add_int_mat2.vert.html 08:35:54 INFO - TEST-SKIP | /webgl/conformance-1.0.3/conformance/glsl/implicit/add_int_mat2.vert.html | took 1ms 08:35:54 INFO - TEST-START | /webgl/conformance-1.0.3/conformance/glsl/implicit/add_int_mat3.vert.html 08:35:54 INFO - TEST-SKIP | /webgl/conformance-1.0.3/conformance/glsl/implicit/add_int_mat3.vert.html | took 0ms 08:35:54 INFO - TEST-START | /webgl/conformance-1.0.3/conformance/glsl/implicit/add_int_mat4.vert.html 08:35:54 INFO - TEST-SKIP | /webgl/conformance-1.0.3/conformance/glsl/implicit/add_int_mat4.vert.html | took 0ms 08:35:54 INFO - TEST-START | /webgl/conformance-1.0.3/conformance/glsl/implicit/add_int_vec2.vert.html 08:35:54 INFO - TEST-SKIP | /webgl/conformance-1.0.3/conformance/glsl/implicit/add_int_vec2.vert.html | took 1ms 08:35:54 INFO - TEST-START | /webgl/conformance-1.0.3/conformance/glsl/implicit/add_int_vec3.vert.html 08:35:54 INFO - TEST-SKIP | /webgl/conformance-1.0.3/conformance/glsl/implicit/add_int_vec3.vert.html | took 0ms 08:35:54 INFO - TEST-START | /webgl/conformance-1.0.3/conformance/glsl/implicit/add_int_vec4.vert.html 08:35:54 INFO - TEST-SKIP | /webgl/conformance-1.0.3/conformance/glsl/implicit/add_int_vec4.vert.html | took 0ms 08:35:54 INFO - TEST-START | /webgl/conformance-1.0.3/conformance/glsl/implicit/add_ivec2_vec2.vert.html 08:35:54 INFO - TEST-SKIP | /webgl/conformance-1.0.3/conformance/glsl/implicit/add_ivec2_vec2.vert.html | took 0ms 08:35:54 INFO - TEST-START | /webgl/conformance-1.0.3/conformance/glsl/implicit/add_ivec3_vec3.vert.html 08:35:54 INFO - TEST-SKIP | /webgl/conformance-1.0.3/conformance/glsl/implicit/add_ivec3_vec3.vert.html | took 1ms 08:35:54 INFO - TEST-START | /webgl/conformance-1.0.3/conformance/glsl/implicit/add_ivec4_vec4.vert.html 08:35:54 INFO - TEST-SKIP | /webgl/conformance-1.0.3/conformance/glsl/implicit/add_ivec4_vec4.vert.html | took 1ms 08:35:54 INFO - TEST-START | /webgl/conformance-1.0.3/conformance/glsl/implicit/assign_int_to_float.vert.html 08:35:54 INFO - TEST-SKIP | /webgl/conformance-1.0.3/conformance/glsl/implicit/assign_int_to_float.vert.html | took 0ms 08:35:54 INFO - TEST-START | /webgl/conformance-1.0.3/conformance/glsl/implicit/assign_ivec2_to_vec2.vert.html 08:35:54 INFO - TEST-SKIP | /webgl/conformance-1.0.3/conformance/glsl/implicit/assign_ivec2_to_vec2.vert.html | took 0ms 08:35:54 INFO - TEST-START | /webgl/conformance-1.0.3/conformance/glsl/implicit/assign_ivec3_to_vec3.vert.html 08:35:54 INFO - TEST-SKIP | /webgl/conformance-1.0.3/conformance/glsl/implicit/assign_ivec3_to_vec3.vert.html | took 0ms 08:35:54 INFO - TEST-START | /webgl/conformance-1.0.3/conformance/glsl/implicit/assign_ivec4_to_vec4.vert.html 08:35:54 INFO - TEST-SKIP | /webgl/conformance-1.0.3/conformance/glsl/implicit/assign_ivec4_to_vec4.vert.html | took 0ms 08:35:54 INFO - TEST-START | /webgl/conformance-1.0.3/conformance/glsl/implicit/construct_struct.vert.html 08:35:54 INFO - TEST-SKIP | /webgl/conformance-1.0.3/conformance/glsl/implicit/construct_struct.vert.html | took 1ms 08:35:54 INFO - TEST-START | /webgl/conformance-1.0.3/conformance/glsl/implicit/divide_int_float.vert.html 08:35:54 INFO - TEST-SKIP | /webgl/conformance-1.0.3/conformance/glsl/implicit/divide_int_float.vert.html | took 1ms 08:35:54 INFO - TEST-START | /webgl/conformance-1.0.3/conformance/glsl/implicit/divide_int_mat2.vert.html 08:35:54 INFO - TEST-SKIP | /webgl/conformance-1.0.3/conformance/glsl/implicit/divide_int_mat2.vert.html | took 1ms 08:35:54 INFO - TEST-START | /webgl/conformance-1.0.3/conformance/glsl/implicit/divide_int_mat3.vert.html 08:35:54 INFO - TEST-SKIP | /webgl/conformance-1.0.3/conformance/glsl/implicit/divide_int_mat3.vert.html | took 0ms 08:35:54 INFO - TEST-START | /webgl/conformance-1.0.3/conformance/glsl/implicit/divide_int_mat4.vert.html 08:35:54 INFO - TEST-SKIP | /webgl/conformance-1.0.3/conformance/glsl/implicit/divide_int_mat4.vert.html | took 0ms 08:35:54 INFO - TEST-START | /webgl/conformance-1.0.3/conformance/glsl/implicit/divide_int_vec2.vert.html 08:35:54 INFO - TEST-SKIP | /webgl/conformance-1.0.3/conformance/glsl/implicit/divide_int_vec2.vert.html | took 0ms 08:35:54 INFO - TEST-START | /webgl/conformance-1.0.3/conformance/glsl/implicit/divide_int_vec3.vert.html 08:35:54 INFO - TEST-SKIP | /webgl/conformance-1.0.3/conformance/glsl/implicit/divide_int_vec3.vert.html | took 0ms 08:35:54 INFO - TEST-START | /webgl/conformance-1.0.3/conformance/glsl/implicit/divide_int_vec4.vert.html 08:35:54 INFO - TEST-SKIP | /webgl/conformance-1.0.3/conformance/glsl/implicit/divide_int_vec4.vert.html | took 1ms 08:35:54 INFO - TEST-START | /webgl/conformance-1.0.3/conformance/glsl/implicit/divide_ivec2_vec2.vert.html 08:35:54 INFO - TEST-SKIP | /webgl/conformance-1.0.3/conformance/glsl/implicit/divide_ivec2_vec2.vert.html | took 1ms 08:35:54 INFO - TEST-START | /webgl/conformance-1.0.3/conformance/glsl/implicit/divide_ivec3_vec3.vert.html 08:35:54 INFO - TEST-SKIP | /webgl/conformance-1.0.3/conformance/glsl/implicit/divide_ivec3_vec3.vert.html | took 1ms 08:35:54 INFO - TEST-START | /webgl/conformance-1.0.3/conformance/glsl/implicit/divide_ivec4_vec4.vert.html 08:35:54 INFO - TEST-SKIP | /webgl/conformance-1.0.3/conformance/glsl/implicit/divide_ivec4_vec4.vert.html | took 0ms 08:35:54 INFO - TEST-START | /webgl/conformance-1.0.3/conformance/glsl/implicit/equal_int_float.vert.html 08:35:54 INFO - TEST-SKIP | /webgl/conformance-1.0.3/conformance/glsl/implicit/equal_int_float.vert.html | took 0ms 08:35:54 INFO - TEST-START | /webgl/conformance-1.0.3/conformance/glsl/implicit/equal_ivec2_vec2.vert.html 08:35:54 INFO - TEST-SKIP | /webgl/conformance-1.0.3/conformance/glsl/implicit/equal_ivec2_vec2.vert.html | took 0ms 08:35:54 INFO - TEST-START | /webgl/conformance-1.0.3/conformance/glsl/implicit/equal_ivec3_vec3.vert.html 08:35:54 INFO - TEST-SKIP | /webgl/conformance-1.0.3/conformance/glsl/implicit/equal_ivec3_vec3.vert.html | took 0ms 08:35:54 INFO - TEST-START | /webgl/conformance-1.0.3/conformance/glsl/implicit/equal_ivec4_vec4.vert.html 08:35:54 INFO - TEST-SKIP | /webgl/conformance-1.0.3/conformance/glsl/implicit/equal_ivec4_vec4.vert.html | took 1ms 08:35:54 INFO - TEST-START | /webgl/conformance-1.0.3/conformance/glsl/implicit/function_int_float.vert.html 08:35:54 INFO - TEST-SKIP | /webgl/conformance-1.0.3/conformance/glsl/implicit/function_int_float.vert.html | took 1ms 08:35:54 INFO - TEST-START | /webgl/conformance-1.0.3/conformance/glsl/implicit/function_ivec2_vec2.vert.html 08:35:54 INFO - TEST-SKIP | /webgl/conformance-1.0.3/conformance/glsl/implicit/function_ivec2_vec2.vert.html | took 0ms 08:35:54 INFO - TEST-START | /webgl/conformance-1.0.3/conformance/glsl/implicit/function_ivec3_vec3.vert.html 08:35:54 INFO - TEST-SKIP | /webgl/conformance-1.0.3/conformance/glsl/implicit/function_ivec3_vec3.vert.html | took 0ms 08:35:54 INFO - TEST-START | /webgl/conformance-1.0.3/conformance/glsl/implicit/function_ivec4_vec4.vert.html 08:35:54 INFO - TEST-SKIP | /webgl/conformance-1.0.3/conformance/glsl/implicit/function_ivec4_vec4.vert.html | took 0ms 08:35:54 INFO - TEST-START | /webgl/conformance-1.0.3/conformance/glsl/implicit/greater_than.vert.html 08:35:54 INFO - TEST-SKIP | /webgl/conformance-1.0.3/conformance/glsl/implicit/greater_than.vert.html | took 0ms 08:35:54 INFO - TEST-START | /webgl/conformance-1.0.3/conformance/glsl/implicit/greater_than_equal.vert.html 08:35:54 INFO - TEST-SKIP | /webgl/conformance-1.0.3/conformance/glsl/implicit/greater_than_equal.vert.html | took 1ms 08:35:54 INFO - TEST-START | /webgl/conformance-1.0.3/conformance/glsl/implicit/less_than.vert.html 08:35:54 INFO - TEST-SKIP | /webgl/conformance-1.0.3/conformance/glsl/implicit/less_than.vert.html | took 1ms 08:35:54 INFO - TEST-START | /webgl/conformance-1.0.3/conformance/glsl/implicit/less_than_equal.vert.html 08:35:54 INFO - TEST-SKIP | /webgl/conformance-1.0.3/conformance/glsl/implicit/less_than_equal.vert.html | took 1ms 08:35:54 INFO - TEST-START | /webgl/conformance-1.0.3/conformance/glsl/implicit/multiply_int_float.vert.html 08:35:54 INFO - TEST-SKIP | /webgl/conformance-1.0.3/conformance/glsl/implicit/multiply_int_float.vert.html | took 0ms 08:35:54 INFO - TEST-START | /webgl/conformance-1.0.3/conformance/glsl/implicit/multiply_int_mat2.vert.html 08:35:54 INFO - TEST-SKIP | /webgl/conformance-1.0.3/conformance/glsl/implicit/multiply_int_mat2.vert.html | took 0ms 08:35:54 INFO - TEST-START | /webgl/conformance-1.0.3/conformance/glsl/implicit/multiply_int_mat3.vert.html 08:35:54 INFO - TEST-SKIP | /webgl/conformance-1.0.3/conformance/glsl/implicit/multiply_int_mat3.vert.html | took 0ms 08:35:54 INFO - TEST-START | /webgl/conformance-1.0.3/conformance/glsl/implicit/multiply_int_mat4.vert.html 08:35:54 INFO - TEST-SKIP | /webgl/conformance-1.0.3/conformance/glsl/implicit/multiply_int_mat4.vert.html | took 1ms 08:35:54 INFO - TEST-START | /webgl/conformance-1.0.3/conformance/glsl/implicit/multiply_int_vec2.vert.html 08:35:54 INFO - TEST-SKIP | /webgl/conformance-1.0.3/conformance/glsl/implicit/multiply_int_vec2.vert.html | took 1ms 08:35:54 INFO - TEST-START | /webgl/conformance-1.0.3/conformance/glsl/implicit/multiply_int_vec3.vert.html 08:35:54 INFO - TEST-SKIP | /webgl/conformance-1.0.3/conformance/glsl/implicit/multiply_int_vec3.vert.html | took 1ms 08:35:54 INFO - TEST-START | /webgl/conformance-1.0.3/conformance/glsl/implicit/multiply_int_vec4.vert.html 08:35:54 INFO - TEST-SKIP | /webgl/conformance-1.0.3/conformance/glsl/implicit/multiply_int_vec4.vert.html | took 0ms 08:35:54 INFO - TEST-START | /webgl/conformance-1.0.3/conformance/glsl/implicit/multiply_ivec2_vec2.vert.html 08:35:54 INFO - TEST-SKIP | /webgl/conformance-1.0.3/conformance/glsl/implicit/multiply_ivec2_vec2.vert.html | took 0ms 08:35:54 INFO - TEST-START | /webgl/conformance-1.0.3/conformance/glsl/implicit/multiply_ivec3_vec3.vert.html 08:35:54 INFO - TEST-SKIP | /webgl/conformance-1.0.3/conformance/glsl/implicit/multiply_ivec3_vec3.vert.html | took 0ms 08:35:54 INFO - TEST-START | /webgl/conformance-1.0.3/conformance/glsl/implicit/multiply_ivec4_vec4.vert.html 08:35:54 INFO - TEST-SKIP | /webgl/conformance-1.0.3/conformance/glsl/implicit/multiply_ivec4_vec4.vert.html | took 1ms 08:35:54 INFO - TEST-START | /webgl/conformance-1.0.3/conformance/glsl/implicit/not_equal_int_float.vert.html 08:35:54 INFO - TEST-SKIP | /webgl/conformance-1.0.3/conformance/glsl/implicit/not_equal_int_float.vert.html | took 1ms 08:35:54 INFO - TEST-START | /webgl/conformance-1.0.3/conformance/glsl/implicit/not_equal_ivec2_vec2.vert.html 08:35:54 INFO - TEST-SKIP | /webgl/conformance-1.0.3/conformance/glsl/implicit/not_equal_ivec2_vec2.vert.html | took 1ms 08:35:54 INFO - TEST-START | /webgl/conformance-1.0.3/conformance/glsl/implicit/not_equal_ivec3_vec3.vert.html 08:35:54 INFO - TEST-SKIP | /webgl/conformance-1.0.3/conformance/glsl/implicit/not_equal_ivec3_vec3.vert.html | took 0ms 08:35:54 INFO - TEST-START | /webgl/conformance-1.0.3/conformance/glsl/implicit/not_equal_ivec4_vec4.vert.html 08:35:54 INFO - TEST-SKIP | /webgl/conformance-1.0.3/conformance/glsl/implicit/not_equal_ivec4_vec4.vert.html | took 0ms 08:35:54 INFO - TEST-START | /webgl/conformance-1.0.3/conformance/glsl/implicit/subtract_int_float.vert.html 08:35:54 INFO - TEST-SKIP | /webgl/conformance-1.0.3/conformance/glsl/implicit/subtract_int_float.vert.html | took 0ms 08:35:54 INFO - TEST-START | /webgl/conformance-1.0.3/conformance/glsl/implicit/subtract_int_mat2.vert.html 08:35:54 INFO - TEST-SKIP | /webgl/conformance-1.0.3/conformance/glsl/implicit/subtract_int_mat2.vert.html | took 0ms 08:35:54 INFO - TEST-START | /webgl/conformance-1.0.3/conformance/glsl/implicit/subtract_int_mat3.vert.html 08:35:54 INFO - TEST-SKIP | /webgl/conformance-1.0.3/conformance/glsl/implicit/subtract_int_mat3.vert.html | took 0ms 08:35:54 INFO - TEST-START | /webgl/conformance-1.0.3/conformance/glsl/implicit/subtract_int_mat4.vert.html 08:35:54 INFO - TEST-SKIP | /webgl/conformance-1.0.3/conformance/glsl/implicit/subtract_int_mat4.vert.html | took 0ms 08:35:54 INFO - TEST-START | /webgl/conformance-1.0.3/conformance/glsl/implicit/subtract_int_vec2.vert.html 08:35:54 INFO - TEST-SKIP | /webgl/conformance-1.0.3/conformance/glsl/implicit/subtract_int_vec2.vert.html | took 1ms 08:35:54 INFO - TEST-START | /webgl/conformance-1.0.3/conformance/glsl/implicit/subtract_int_vec3.vert.html 08:35:54 INFO - TEST-SKIP | /webgl/conformance-1.0.3/conformance/glsl/implicit/subtract_int_vec3.vert.html | took 0ms 08:35:54 INFO - TEST-START | /webgl/conformance-1.0.3/conformance/glsl/implicit/subtract_int_vec4.vert.html 08:35:54 INFO - TEST-SKIP | /webgl/conformance-1.0.3/conformance/glsl/implicit/subtract_int_vec4.vert.html | took 0ms 08:35:54 INFO - TEST-START | /webgl/conformance-1.0.3/conformance/glsl/implicit/subtract_ivec2_vec2.vert.html 08:35:54 INFO - TEST-SKIP | /webgl/conformance-1.0.3/conformance/glsl/implicit/subtract_ivec2_vec2.vert.html | took 0ms 08:35:54 INFO - TEST-START | /webgl/conformance-1.0.3/conformance/glsl/implicit/subtract_ivec3_vec3.vert.html 08:35:54 INFO - TEST-SKIP | /webgl/conformance-1.0.3/conformance/glsl/implicit/subtract_ivec3_vec3.vert.html | took 1ms 08:35:54 INFO - TEST-START | /webgl/conformance-1.0.3/conformance/glsl/implicit/subtract_ivec4_vec4.vert.html 08:35:54 INFO - TEST-SKIP | /webgl/conformance-1.0.3/conformance/glsl/implicit/subtract_ivec4_vec4.vert.html | took 1ms 08:35:54 INFO - TEST-START | /webgl/conformance-1.0.3/conformance/glsl/implicit/ternary_int_float.vert.html 08:35:54 INFO - TEST-SKIP | /webgl/conformance-1.0.3/conformance/glsl/implicit/ternary_int_float.vert.html | took 1ms 08:35:54 INFO - TEST-START | /webgl/conformance-1.0.3/conformance/glsl/implicit/ternary_ivec2_vec2.vert.html 08:35:54 INFO - TEST-SKIP | /webgl/conformance-1.0.3/conformance/glsl/implicit/ternary_ivec2_vec2.vert.html | took 0ms 08:35:54 INFO - TEST-START | /webgl/conformance-1.0.3/conformance/glsl/implicit/ternary_ivec3_vec3.vert.html 08:35:54 INFO - TEST-SKIP | /webgl/conformance-1.0.3/conformance/glsl/implicit/ternary_ivec3_vec3.vert.html | took 0ms 08:35:54 INFO - TEST-START | /webgl/conformance-1.0.3/conformance/glsl/implicit/ternary_ivec4_vec4.vert.html 08:35:54 INFO - TEST-SKIP | /webgl/conformance-1.0.3/conformance/glsl/implicit/ternary_ivec4_vec4.vert.html | took 0ms 08:35:54 INFO - TEST-START | /webgl/conformance-1.0.3/conformance/ogles/GL/abs/abs_001_to_006.html 08:35:54 INFO - TEST-SKIP | /webgl/conformance-1.0.3/conformance/ogles/GL/abs/abs_001_to_006.html | took 0ms 08:35:54 INFO - TEST-START | /webgl/conformance-1.0.3/conformance/ogles/GL/inversesqrt/inversesqrt_001_to_006.html 08:35:54 INFO - TEST-SKIP | /webgl/conformance-1.0.3/conformance/ogles/GL/inversesqrt/inversesqrt_001_to_006.html | took 1ms 08:35:54 INFO - TEST-START | /webgl/conformance-1.0.3/conformance/ogles/GL/refract/refract_001_to_006.html 08:35:54 INFO - TEST-SKIP | /webgl/conformance-1.0.3/conformance/ogles/GL/refract/refract_001_to_006.html | took 1ms 08:35:54 INFO - TEST-START | /websockets/interfaces/WebSocket/close/close-basic.html 08:35:54 INFO - TEST-SKIP | /websockets/interfaces/WebSocket/close/close-basic.html | took 0ms 08:35:54 INFO - TEST-START | /websockets/interfaces/WebSocket/close/close-basic.html?wss 08:35:54 INFO - TEST-SKIP | /websockets/interfaces/WebSocket/close/close-basic.html?wss | took 0ms 08:35:54 INFO - TEST-START | /websockets/interfaces/WebSocket/close/close-connecting.html 08:35:54 INFO - TEST-SKIP | /websockets/interfaces/WebSocket/close/close-connecting.html | took 0ms 08:35:54 INFO - TEST-START | /websockets/interfaces/WebSocket/close/close-connecting.html?wss 08:35:54 INFO - TEST-SKIP | /websockets/interfaces/WebSocket/close/close-connecting.html?wss | took 0ms 08:35:54 INFO - TEST-START | /websockets/interfaces/WebSocket/close/close-multiple.html?wss 08:35:54 INFO - TEST-SKIP | /websockets/interfaces/WebSocket/close/close-multiple.html?wss | took 1ms 08:35:54 INFO - TEST-START | /websockets/interfaces/WebSocket/close/close-multiple.html 08:35:54 INFO - TEST-SKIP | /websockets/interfaces/WebSocket/close/close-multiple.html | took 0ms 08:35:54 INFO - TEST-START | /websockets/interfaces/WebSocket/close/close-nested.html 08:35:54 INFO - TEST-SKIP | /websockets/interfaces/WebSocket/close/close-nested.html | took 0ms 08:35:54 INFO - TEST-START | /websockets/interfaces/WebSocket/close/close-nested.html?wss 08:35:54 INFO - TEST-SKIP | /websockets/interfaces/WebSocket/close/close-nested.html?wss | took 0ms 08:35:54 INFO - TEST-START | /websockets/interfaces/WebSocket/close/close-replace.html 08:35:54 INFO - TEST-SKIP | /websockets/interfaces/WebSocket/close/close-replace.html | took 1ms 08:35:54 INFO - TEST-START | /websockets/interfaces/WebSocket/close/close-replace.html?wss 08:35:54 INFO - TEST-SKIP | /websockets/interfaces/WebSocket/close/close-replace.html?wss | took 1ms 08:35:54 INFO - TEST-START | /websockets/interfaces/WebSocket/close/close-return.html?wss 08:35:54 INFO - TEST-SKIP | /websockets/interfaces/WebSocket/close/close-return.html?wss | took 0ms 08:35:54 INFO - TEST-START | /websockets/interfaces/WebSocket/close/close-return.html 08:35:54 INFO - TEST-SKIP | /websockets/interfaces/WebSocket/close/close-return.html | took 0ms 08:35:54 INFO - TEST-START | /websockets/interfaces/WebSocket/extensions/001.html 08:35:54 INFO - TEST-SKIP | /websockets/interfaces/WebSocket/extensions/001.html | took 0ms 08:35:54 INFO - TEST-START | /websockets/interfaces/WebSocket/extensions/001.html?wss 08:35:54 INFO - TEST-SKIP | /websockets/interfaces/WebSocket/extensions/001.html?wss | took 1ms 08:35:55 INFO - Setting up ssl 08:35:55 INFO - PROCESS | certutil | 08:35:55 INFO - PROCESS | certutil | 08:35:55 INFO - PROCESS | certutil | 08:35:55 INFO - Certificate Nickname Trust Attributes 08:35:55 INFO - SSL,S/MIME,JAR/XPI 08:35:55 INFO - 08:35:55 INFO - web-platform-tests CT,, 08:35:55 INFO - 08:35:55 INFO - Application command: C:\slave\test\build\application\firefox\firefox.exe -marionette about:blank -profile c:\users\cltbld~1.t-w\appdata\local\temp\tmpmcalcu.mozrunner 08:35:55 INFO - Starting runner 08:35:56 INFO - PROCESS | 1456 | [1456] WARNING: Failed to load startupcache file correctly, removing!: file c:/builds/moz2_slave/m-aurora-w64-d-000000000000000/build/src/startupcache/StartupCache.cpp, line 219 08:35:56 INFO - PROCESS | 1456 | [1456] WARNING: NS_ENSURE_SUCCESS(rv, rv) failed with result 0x80004005: file c:/builds/moz2_slave/m-aurora-w64-d-000000000000000/build/src/xpcom/base/nsSystemInfo.cpp, line 116 08:35:56 INFO - PROCESS | 1456 | [1456] WARNING: This method is lossy. Use GetCanonicalPath !: file c:/builds/moz2_slave/m-aurora-w64-d-000000000000000/build/src/xpcom/io/nsLocalFileWin.cpp, line 3576 08:35:58 INFO - PROCESS | 1456 | 1482424558577 Marionette DEBUG Marionette enabled via build flag and pref 08:35:59 INFO - PROCESS | 1456 | ++DOCSHELL 0000006200640000 == 1 [pid = 1456] [id = 1] 08:35:59 INFO - PROCESS | 1456 | ++DOMWINDOW == 1 (000000620D50F000) [pid = 1456] [serial = 1] [outer = 0000000000000000] 08:35:59 INFO - PROCESS | 1456 | ++DOMWINDOW == 2 (000000620D510000) [pid = 1456] [serial = 2] [outer = 000000620D50F000] 08:36:00 INFO - PROCESS | 1456 | ++DOCSHELL 000000620D509000 == 2 [pid = 1456] [id = 2] 08:36:00 INFO - PROCESS | 1456 | ++DOMWINDOW == 3 (000000621185D000) [pid = 1456] [serial = 3] [outer = 0000000000000000] 08:36:00 INFO - PROCESS | 1456 | ++DOMWINDOW == 4 (000000621185E000) [pid = 1456] [serial = 4] [outer = 000000621185D000] 08:36:00 INFO - PROCESS | 1456 | 1482424560681 Marionette INFO Listening on port 2828 08:36:02 INFO - PROCESS | 1456 | 1482424562575 Marionette DEBUG Marionette enabled via command-line flag 08:36:02 INFO - PROCESS | 1456 | ++DOCSHELL 0000006212914800 == 3 [pid = 1456] [id = 3] 08:36:02 INFO - PROCESS | 1456 | ++DOMWINDOW == 5 (0000006212B02800) [pid = 1456] [serial = 5] [outer = 0000000000000000] 08:36:02 INFO - PROCESS | 1456 | ++DOMWINDOW == 6 (0000006212B03800) [pid = 1456] [serial = 6] [outer = 0000006212B02800] 08:36:02 INFO - PROCESS | 1456 | ++DOMWINDOW == 7 (0000006213595800) [pid = 1456] [serial = 7] [outer = 000000621185D000] 08:36:02 INFO - PROCESS | 1456 | 1482424562968 Marionette DEBUG Accepted connection conn0 from 127.0.0.1:49310 08:36:03 INFO - PROCESS | 1456 | 1482424562988 Marionette DEBUG Accepted connection conn1 from 127.0.0.1:49311 08:36:03 INFO - PROCESS | 1456 | 1482424562997 Marionette DEBUG Accepted connection conn2 from 127.0.0.1:49312 08:36:03 INFO - PROCESS | 1456 | 1482424563031 Marionette DEBUG Accepted connection conn3 from 127.0.0.1:49313 08:36:03 INFO - PROCESS | 1456 | 1482424563034 Marionette DEBUG Closed connection conn0 08:36:03 INFO - PROCESS | 1456 | 1482424563036 Marionette DEBUG Closed connection conn1 08:36:03 INFO - PROCESS | 1456 | 1482424563039 Marionette DEBUG Closed connection conn2 08:36:03 INFO - PROCESS | 1456 | 1482424563119 Marionette DEBUG Closed connection conn3 08:36:03 INFO - PROCESS | 1456 | 1482424563125 Marionette DEBUG Accepted connection conn4 from 127.0.0.1:49314 08:36:03 INFO - PROCESS | 1456 | 1482424563242 Marionette DEBUG Closed connection conn4 08:36:03 INFO - PROCESS | 1456 | 1482424563249 Marionette DEBUG Accepted connection conn5 from 127.0.0.1:49315 08:36:03 INFO - PROCESS | 1456 | ++DOCSHELL 000000620D50E800 == 4 [pid = 1456] [id = 4] 08:36:03 INFO - PROCESS | 1456 | ++DOMWINDOW == 8 (0000006213D82000) [pid = 1456] [serial = 8] [outer = 0000000000000000] 08:36:03 INFO - PROCESS | 1456 | ++DOMWINDOW == 9 (00000062163B9800) [pid = 1456] [serial = 9] [outer = 0000006213D82000] 08:36:03 INFO - PROCESS | 1456 | ++DOMWINDOW == 10 (00000062163C4000) [pid = 1456] [serial = 10] [outer = 0000006213D82000] 08:36:03 INFO - PROCESS | 1456 | 1482424563448 Marionette TRACE conn5 -> [0,1,"newSession",{"sessionId":null,"capabilities":null}] 08:36:03 INFO - PROCESS | 1456 | 1482424563454 Marionette CONFIG Changing capabilities: {"browserName":"firefox","browserVersion":"52.0a2","platformName":"windows_nt","platformVersion":"6.2","acceptInsecureCerts":false,"rotatable":false,"proxy":{},"specificationLevel":0,"moz:processID":1456,"moz:profile":"c:\\users\\cltbld~1.t-w\\appdata\\local\\temp\\tmpmcalcu.mozrunner","moz:accessibilityChecks":false} 08:36:04 INFO - PROCESS | 1456 | [1456] WARNING: attempt to modify an immutable nsStandardURL: file c:/builds/moz2_slave/m-aurora-w64-d-000000000000000/build/src/netwerk/base/nsStandardURL.cpp, line 1566 08:36:04 INFO - PROCESS | 1456 | [1456] WARNING: attempt to modify an immutable nsStandardURL: file c:/builds/moz2_slave/m-aurora-w64-d-000000000000000/build/src/netwerk/base/nsStandardURL.cpp, line 1566 08:36:04 INFO - PROCESS | 1456 | [1456] WARNING: Failed to retarget HTML data delivery to the parser thread.: file c:/builds/moz2_slave/m-aurora-w64-d-000000000000000/build/src/parser/html/nsHtml5StreamParser.cpp, line 970 08:36:05 INFO - PROCESS | 1456 | [1456] WARNING: getting z level of unregistered window: file c:/builds/moz2_slave/m-aurora-w64-d-000000000000000/build/src/xpfe/appshell/nsWindowMediator.cpp, line 623 08:36:05 INFO - PROCESS | 1456 | [1456] WARNING: getting z level of unregistered window: file c:/builds/moz2_slave/m-aurora-w64-d-000000000000000/build/src/xpfe/appshell/nsWindowMediator.cpp, line 623 08:36:05 INFO - PROCESS | 1456 | [1456] WARNING: NS_ENSURE_TRUE(layerManager) failed: file c:/builds/moz2_slave/m-aurora-w64-d-000000000000000/build/src/dom/media/MediaDecoder.cpp, line 301 08:36:05 INFO - PROCESS | 1456 | ++DOCSHELL 0000006217B57000 == 5 [pid = 1456] [id = 5] 08:36:05 INFO - PROCESS | 1456 | ++DOMWINDOW == 11 (000000621981B000) [pid = 1456] [serial = 11] [outer = 0000000000000000] 08:36:05 INFO - PROCESS | 1456 | ++DOCSHELL 000000621981D000 == 6 [pid = 1456] [id = 6] 08:36:05 INFO - PROCESS | 1456 | ++DOMWINDOW == 12 (000000621981D800) [pid = 1456] [serial = 12] [outer = 0000000000000000] 08:36:06 INFO - PROCESS | 1456 | ++DOCSHELL 000000621A4A5000 == 7 [pid = 1456] [id = 7] 08:36:06 INFO - PROCESS | 1456 | ++DOMWINDOW == 13 (000000621A4A5800) [pid = 1456] [serial = 13] [outer = 0000000000000000] 08:36:06 INFO - PROCESS | 1456 | ++DOMWINDOW == 14 (000000621A94B800) [pid = 1456] [serial = 14] [outer = 000000621A4A5800] 08:36:06 INFO - PROCESS | 1456 | ++DOMWINDOW == 15 (000000621AD1D000) [pid = 1456] [serial = 15] [outer = 000000621981B000] 08:36:06 INFO - PROCESS | 1456 | ++DOMWINDOW == 16 (000000621AD20000) [pid = 1456] [serial = 16] [outer = 000000621981D800] 08:36:06 INFO - PROCESS | 1456 | ++DOMWINDOW == 17 (000000621AD24800) [pid = 1456] [serial = 17] [outer = 000000621A4A5800] 08:36:07 INFO - PROCESS | 1456 | 1482424567421 Marionette DEBUG loaded listener.js 08:36:07 INFO - PROCESS | 1456 | JavaScript error: chrome://marionette/content/driver.js, line 228: ReferenceError: data is not defined 08:36:08 INFO - PROCESS | 1456 | ++DOMWINDOW == 18 (000000621D2E6000) [pid = 1456] [serial = 18] [outer = 000000621A4A5800] 08:36:10 INFO - PROCESS | 1456 | --DOCSHELL 0000006200640000 == 6 [pid = 1456] [id = 1] 08:36:11 INFO - PROCESS | 1456 | --DOCSHELL 000000620D50E800 == 5 [pid = 1456] [id = 4] 08:36:13 INFO - PROCESS | 1456 | ++DOCSHELL 000000620C19E000 == 6 [pid = 1456] [id = 8] 08:36:13 INFO - PROCESS | 1456 | ++DOMWINDOW == 19 (000000620C19E800) [pid = 1456] [serial = 19] [outer = 0000000000000000] 08:36:13 INFO - PROCESS | 1456 | ++DOMWINDOW == 20 (000000620C1AC800) [pid = 1456] [serial = 20] [outer = 000000620C19E800] 08:36:13 INFO - PROCESS | 1456 | ++DOMWINDOW == 21 (000000620C3AE000) [pid = 1456] [serial = 21] [outer = 000000620C19E800] 08:36:13 INFO - PROCESS | 1456 | ++DOCSHELL 000000620BD36800 == 7 [pid = 1456] [id = 9] 08:36:13 INFO - PROCESS | 1456 | ++DOMWINDOW == 22 (000000620C3B9000) [pid = 1456] [serial = 22] [outer = 0000000000000000] 08:36:13 INFO - PROCESS | 1456 | ++DOMWINDOW == 23 (000000620C429800) [pid = 1456] [serial = 23] [outer = 000000620C3B9000] 08:36:13 INFO - PROCESS | 1456 | [1456] WARNING: Could not get disk status from nsIDiskSpaceWatcher: file c:/builds/moz2_slave/m-aurora-w64-d-000000000000000/build/src/uriloader/prefetch/nsOfflineCacheUpdateService.cpp, line 283 08:36:13 INFO - PROCESS | 1456 | ++DOMWINDOW == 24 (000000620CDE3000) [pid = 1456] [serial = 24] [outer = 000000620C3B9000] 08:36:18 INFO - PROCESS | 1456 | [1456] WARNING: NS_ENSURE_TRUE(layerManager) failed: file c:/builds/moz2_slave/m-aurora-w64-d-000000000000000/build/src/dom/media/MediaDecoder.cpp, line 301 08:36:18 INFO - PROCESS | 1456 | [1456] WARNING: NS_ENSURE_TRUE(layerManager) failed: file c:/builds/moz2_slave/m-aurora-w64-d-000000000000000/build/src/dom/media/MediaDecoder.cpp, line 301 08:36:18 INFO - PROCESS | 1456 | --DOMWINDOW == 23 (0000006213D82000) [pid = 1456] [serial = 8] [outer = 0000000000000000] [url = chrome://gfxsanity/content/sanitytest.html] 08:36:18 INFO - PROCESS | 1456 | --DOMWINDOW == 22 (000000620D50F000) [pid = 1456] [serial = 1] [outer = 0000000000000000] [url = chrome://gfxsanity/content/sanityparent.html] 08:36:24 INFO - PROCESS | 1456 | --DOMWINDOW == 21 (000000621A94B800) [pid = 1456] [serial = 14] [outer = 0000000000000000] [url = about:blank] 08:36:24 INFO - PROCESS | 1456 | --DOMWINDOW == 20 (00000062163B9800) [pid = 1456] [serial = 9] [outer = 0000000000000000] [url = about:blank] 08:36:24 INFO - PROCESS | 1456 | --DOMWINDOW == 19 (00000062163C4000) [pid = 1456] [serial = 10] [outer = 0000000000000000] [url = chrome://gfxsanity/content/sanitytest.html] 08:36:24 INFO - PROCESS | 1456 | --DOMWINDOW == 18 (000000621185E000) [pid = 1456] [serial = 4] [outer = 0000000000000000] [url = about:blank] 08:36:24 INFO - PROCESS | 1456 | --DOMWINDOW == 17 (000000620D510000) [pid = 1456] [serial = 2] [outer = 0000000000000000] [url = about:blank] 08:36:31 INFO - PROCESS | 1456 | --DOMWINDOW == 16 (000000620C1AC800) [pid = 1456] [serial = 20] [outer = 0000000000000000] [url = about:blank] 08:36:31 INFO - PROCESS | 1456 | --DOMWINDOW == 15 (000000621AD24800) [pid = 1456] [serial = 17] [outer = 0000000000000000] [url = about:blank] 08:36:31 INFO - PROCESS | 1456 | --DOMWINDOW == 14 (000000620C429800) [pid = 1456] [serial = 23] [outer = 0000000000000000] [url = about:blank] 08:36:43 INFO - PROCESS | 1456 | ++DOMWINDOW == 15 (000000620C344800) [pid = 1456] [serial = 25] [outer = 000000620C3B9000] 08:36:54 WARNING - Init failed 1 08:36:55 WARNING - u'log' (u'warning', {'message': 'Starting marionette session failed: [Errno 10054] An existing connection was forcibly closed by the remote host'}) 08:36:55 WARNING - u'log' (u'warning', {'message': 'Failed to connect to Marionette'}) 08:36:55 WARNING - 'init_failed' () 08:36:55 WARNING - u'runner_teardown' () 08:36:55 INFO - Setting up ssl 08:36:55 INFO - PROCESS | certutil | 08:36:55 INFO - PROCESS | certutil | 08:36:55 INFO - PROCESS | certutil | 08:36:55 INFO - Certificate Nickname Trust Attributes 08:36:55 INFO - SSL,S/MIME,JAR/XPI 08:36:55 INFO - 08:36:55 INFO - web-platform-tests CT,, 08:36:55 INFO - 08:36:56 INFO - Application command: C:\slave\test\build\application\firefox\firefox.exe -marionette about:blank -profile c:\users\cltbld~1.t-w\appdata\local\temp\tmp7_nzwj.mozrunner 08:36:56 INFO - Starting runner 08:36:56 INFO - PROCESS | 3956 | [3956] WARNING: Failed to load startupcache file correctly, removing!: file c:/builds/moz2_slave/m-aurora-w64-d-000000000000000/build/src/startupcache/StartupCache.cpp, line 219 08:36:56 INFO - PROCESS | 3956 | [3956] WARNING: NS_ENSURE_SUCCESS(rv, rv) failed with result 0x80004005: file c:/builds/moz2_slave/m-aurora-w64-d-000000000000000/build/src/xpcom/base/nsSystemInfo.cpp, line 116 08:36:56 INFO - PROCESS | 3956 | [3956] WARNING: This method is lossy. Use GetCanonicalPath !: file c:/builds/moz2_slave/m-aurora-w64-d-000000000000000/build/src/xpcom/io/nsLocalFileWin.cpp, line 3576 08:36:58 INFO - PROCESS | 3956 | 1482424618659 Marionette DEBUG Marionette enabled via build flag and pref 08:36:59 INFO - PROCESS | 3956 | ++DOCSHELL 000000C28B44D000 == 1 [pid = 3956] [id = 1] 08:36:59 INFO - PROCESS | 3956 | ++DOMWINDOW == 1 (000000C28B44D800) [pid = 3956] [serial = 1] [outer = 0000000000000000] 08:36:59 INFO - PROCESS | 3956 | ++DOMWINDOW == 2 (000000C28B44E800) [pid = 3956] [serial = 2] [outer = 000000C28B44D800] 08:37:00 INFO - PROCESS | 3956 | ++DOCSHELL 000000C28BA39000 == 2 [pid = 3956] [id = 2] 08:37:00 INFO - PROCESS | 3956 | ++DOMWINDOW == 3 (000000C28F657000) [pid = 3956] [serial = 3] [outer = 0000000000000000] 08:37:00 INFO - PROCESS | 3956 | ++DOMWINDOW == 4 (000000C28F658000) [pid = 3956] [serial = 4] [outer = 000000C28F657000] 08:37:00 INFO - PROCESS | 3956 | 1482424620656 Marionette INFO Listening on port 2829 08:37:02 INFO - PROCESS | 3956 | 1482424622622 Marionette DEBUG Marionette enabled via command-line flag 08:37:02 INFO - PROCESS | 3956 | ++DOCSHELL 000000C290712800 == 3 [pid = 3956] [id = 3] 08:37:02 INFO - PROCESS | 3956 | ++DOMWINDOW == 5 (000000C290722800) [pid = 3956] [serial = 5] [outer = 0000000000000000] 08:37:02 INFO - PROCESS | 3956 | ++DOMWINDOW == 6 (000000C2907DF000) [pid = 3956] [serial = 6] [outer = 000000C290722800] 08:37:02 INFO - PROCESS | 3956 | ++DOMWINDOW == 7 (000000C291348800) [pid = 3956] [serial = 7] [outer = 000000C28F657000] 08:37:02 INFO - PROCESS | 3956 | 1482424622882 Marionette DEBUG Accepted connection conn0 from 127.0.0.1:49325 08:37:02 INFO - PROCESS | 3956 | 1482424622904 Marionette DEBUG Accepted connection conn1 from 127.0.0.1:49326 08:37:02 INFO - PROCESS | 3956 | 1482424622912 Marionette DEBUG Accepted connection conn2 from 127.0.0.1:49327 08:37:02 INFO - PROCESS | 3956 | 1482424622947 Marionette DEBUG Accepted connection conn3 from 127.0.0.1:49328 08:37:02 INFO - PROCESS | 3956 | 1482424622952 Marionette DEBUG Closed connection conn0 08:37:02 INFO - PROCESS | 3956 | 1482424622954 Marionette DEBUG Closed connection conn1 08:37:02 INFO - PROCESS | 3956 | 1482424622956 Marionette DEBUG Closed connection conn2 08:37:03 INFO - PROCESS | 3956 | 1482424623040 Marionette DEBUG Closed connection conn3 08:37:03 INFO - PROCESS | 3956 | 1482424623046 Marionette DEBUG Accepted connection conn4 from 127.0.0.1:49329 08:37:03 INFO - PROCESS | 3956 | 1482424623065 Marionette DEBUG Closed connection conn4 08:37:03 INFO - PROCESS | 3956 | 1482424623072 Marionette DEBUG Accepted connection conn5 from 127.0.0.1:49330 08:37:03 INFO - PROCESS | 3956 | ++DOCSHELL 000000C28B44C800 == 4 [pid = 3956] [id = 4] 08:37:03 INFO - PROCESS | 3956 | ++DOMWINDOW == 8 (000000C291C7B000) [pid = 3956] [serial = 8] [outer = 0000000000000000] 08:37:03 INFO - PROCESS | 3956 | ++DOMWINDOW == 9 (000000C294180800) [pid = 3956] [serial = 9] [outer = 000000C291C7B000] 08:37:03 INFO - PROCESS | 3956 | ++DOMWINDOW == 10 (000000C29418B800) [pid = 3956] [serial = 10] [outer = 000000C291C7B000] 08:37:03 INFO - PROCESS | 3956 | 1482424623254 Marionette TRACE conn5 -> [0,1,"newSession",{"sessionId":null,"capabilities":null}] 08:37:03 INFO - PROCESS | 3956 | 1482424623259 Marionette CONFIG Changing capabilities: {"browserName":"firefox","browserVersion":"52.0a2","platformName":"windows_nt","platformVersion":"6.2","acceptInsecureCerts":false,"rotatable":false,"proxy":{},"specificationLevel":0,"moz:processID":3956,"moz:profile":"c:\\users\\cltbld~1.t-w\\appdata\\local\\temp\\tmp7_nzwj.mozrunner","moz:accessibilityChecks":false} 08:37:03 INFO - PROCESS | 3956 | [3956] WARNING: getting z level of unregistered window: file c:/builds/moz2_slave/m-aurora-w64-d-000000000000000/build/src/xpfe/appshell/nsWindowMediator.cpp, line 623 08:37:03 INFO - PROCESS | 3956 | [3956] WARNING: getting z level of unregistered window: file c:/builds/moz2_slave/m-aurora-w64-d-000000000000000/build/src/xpfe/appshell/nsWindowMediator.cpp, line 623 08:37:03 INFO - PROCESS | 3956 | [3956] WARNING: NS_ENSURE_TRUE(layerManager) failed: file c:/builds/moz2_slave/m-aurora-w64-d-000000000000000/build/src/dom/media/MediaDecoder.cpp, line 301 08:37:04 INFO - PROCESS | 3956 | [3956] WARNING: attempt to modify an immutable nsStandardURL: file c:/builds/moz2_slave/m-aurora-w64-d-000000000000000/build/src/netwerk/base/nsStandardURL.cpp, line 1566 08:37:04 INFO - PROCESS | 3956 | [3956] WARNING: attempt to modify an immutable nsStandardURL: file c:/builds/moz2_slave/m-aurora-w64-d-000000000000000/build/src/netwerk/base/nsStandardURL.cpp, line 1566 08:37:04 INFO - PROCESS | 3956 | [3956] WARNING: Failed to retarget HTML data delivery to the parser thread.: file c:/builds/moz2_slave/m-aurora-w64-d-000000000000000/build/src/parser/html/nsHtml5StreamParser.cpp, line 970 08:37:04 INFO - PROCESS | 3956 | ++DOCSHELL 000000C2905AB000 == 5 [pid = 3956] [id = 5] 08:37:04 INFO - PROCESS | 3956 | ++DOMWINDOW == 11 (000000C2905AB800) [pid = 3956] [serial = 11] [outer = 0000000000000000] 08:37:04 INFO - PROCESS | 3956 | ++DOCSHELL 000000C2905AD000 == 6 [pid = 3956] [id = 6] 08:37:04 INFO - PROCESS | 3956 | ++DOMWINDOW == 12 (000000C2905AD800) [pid = 3956] [serial = 12] [outer = 0000000000000000] 08:37:05 INFO - PROCESS | 3956 | ++DOCSHELL 000000C2980F1000 == 7 [pid = 3956] [id = 7] 08:37:05 INFO - PROCESS | 3956 | ++DOMWINDOW == 13 (000000C2980F1800) [pid = 3956] [serial = 13] [outer = 0000000000000000] 08:37:05 INFO - PROCESS | 3956 | ++DOMWINDOW == 14 (000000C2980FC000) [pid = 3956] [serial = 14] [outer = 000000C2980F1800] 08:37:05 INFO - PROCESS | 3956 | ++DOMWINDOW == 15 (000000C28A069800) [pid = 3956] [serial = 15] [outer = 000000C2905AB800] 08:37:05 INFO - PROCESS | 3956 | ++DOMWINDOW == 16 (000000C28B7E0000) [pid = 3956] [serial = 16] [outer = 000000C2905AD800] 08:37:05 INFO - PROCESS | 3956 | ++DOMWINDOW == 17 (000000C298555800) [pid = 3956] [serial = 17] [outer = 000000C2980F1800] 08:37:06 INFO - PROCESS | 3956 | 1482424626279 Marionette DEBUG loaded listener.js 08:37:06 INFO - PROCESS | 3956 | JavaScript error: chrome://marionette/content/driver.js, line 228: ReferenceError: data is not defined 08:37:07 INFO - PROCESS | 3956 | ++DOMWINDOW == 18 (000000C29A55C000) [pid = 3956] [serial = 18] [outer = 000000C2980F1800] 08:37:09 INFO - PROCESS | 3956 | --DOCSHELL 000000C28B44D000 == 6 [pid = 3956] [id = 1] 08:37:11 INFO - PROCESS | 3956 | --DOCSHELL 000000C28B44C800 == 5 [pid = 3956] [id = 4] 08:37:12 INFO - PROCESS | 3956 | ++DOCSHELL 000000C28A075000 == 6 [pid = 3956] [id = 8] 08:37:12 INFO - PROCESS | 3956 | ++DOMWINDOW == 19 (000000C28A099000) [pid = 3956] [serial = 19] [outer = 0000000000000000] 08:37:12 INFO - PROCESS | 3956 | ++DOMWINDOW == 20 (000000C28A09F000) [pid = 3956] [serial = 20] [outer = 000000C28A099000] 08:37:12 INFO - PROCESS | 3956 | ++DOMWINDOW == 21 (000000C28A25A000) [pid = 3956] [serial = 21] [outer = 000000C28A099000] 08:37:12 INFO - PROCESS | 3956 | ++DOCSHELL 000000C289A36800 == 7 [pid = 3956] [id = 9] 08:37:12 INFO - PROCESS | 3956 | ++DOMWINDOW == 22 (000000C28A327000) [pid = 3956] [serial = 22] [outer = 0000000000000000] 08:37:12 INFO - PROCESS | 3956 | ++DOMWINDOW == 23 (000000C28A3BC800) [pid = 3956] [serial = 23] [outer = 000000C28A327000] 08:37:12 INFO - PROCESS | 3956 | [3956] WARNING: Could not get disk status from nsIDiskSpaceWatcher: file c:/builds/moz2_slave/m-aurora-w64-d-000000000000000/build/src/uriloader/prefetch/nsOfflineCacheUpdateService.cpp, line 283 08:37:12 INFO - PROCESS | 3956 | ++DOMWINDOW == 24 (000000C28ACD6000) [pid = 3956] [serial = 24] [outer = 000000C28A327000] 08:37:18 INFO - PROCESS | 3956 | [3956] WARNING: NS_ENSURE_TRUE(layerManager) failed: file c:/builds/moz2_slave/m-aurora-w64-d-000000000000000/build/src/dom/media/MediaDecoder.cpp, line 301 08:37:18 INFO - PROCESS | 3956 | [3956] WARNING: NS_ENSURE_TRUE(layerManager) failed: file c:/builds/moz2_slave/m-aurora-w64-d-000000000000000/build/src/dom/media/MediaDecoder.cpp, line 301 08:37:18 INFO - PROCESS | 3956 | --DOMWINDOW == 23 (000000C28B44D800) [pid = 3956] [serial = 1] [outer = 0000000000000000] [url = chrome://gfxsanity/content/sanityparent.html] 08:37:18 INFO - PROCESS | 3956 | --DOMWINDOW == 22 (000000C291C7B000) [pid = 3956] [serial = 8] [outer = 0000000000000000] [url = chrome://gfxsanity/content/sanitytest.html] 08:37:23 INFO - PROCESS | 3956 | --DOMWINDOW == 21 (000000C2980FC000) [pid = 3956] [serial = 14] [outer = 0000000000000000] [url = about:blank] 08:37:23 INFO - PROCESS | 3956 | --DOMWINDOW == 20 (000000C294180800) [pid = 3956] [serial = 9] [outer = 0000000000000000] [url = about:blank] 08:37:23 INFO - PROCESS | 3956 | --DOMWINDOW == 19 (000000C29418B800) [pid = 3956] [serial = 10] [outer = 0000000000000000] [url = chrome://gfxsanity/content/sanitytest.html] 08:37:23 INFO - PROCESS | 3956 | --DOMWINDOW == 18 (000000C28F658000) [pid = 3956] [serial = 4] [outer = 0000000000000000] [url = about:blank] 08:37:23 INFO - PROCESS | 3956 | --DOMWINDOW == 17 (000000C28B44E800) [pid = 3956] [serial = 2] [outer = 0000000000000000] [url = about:blank] 08:37:30 INFO - PROCESS | 3956 | --DOMWINDOW == 16 (000000C28A09F000) [pid = 3956] [serial = 20] [outer = 0000000000000000] [url = about:blank] 08:37:30 INFO - PROCESS | 3956 | --DOMWINDOW == 15 (000000C28A3BC800) [pid = 3956] [serial = 23] [outer = 0000000000000000] [url = about:blank] 08:37:30 INFO - PROCESS | 3956 | --DOMWINDOW == 14 (000000C298555800) [pid = 3956] [serial = 17] [outer = 0000000000000000] [url = about:blank] 08:37:42 INFO - PROCESS | 3956 | ++DOMWINDOW == 15 (000000C28A0B2800) [pid = 3956] [serial = 25] [outer = 000000C28A327000] 08:37:55 WARNING - Init failed 2 08:37:55 WARNING - u'log' (u'warning', {'message': 'Starting marionette session failed: [Errno 10054] An existing connection was forcibly closed by the remote host'}) 08:37:55 WARNING - u'log' (u'warning', {'message': 'Failed to connect to Marionette'}) 08:37:55 WARNING - 'init_failed' () 08:37:55 WARNING - u'runner_teardown' () 08:37:55 INFO - Setting up ssl 08:37:56 INFO - PROCESS | certutil | 08:37:56 INFO - PROCESS | certutil | 08:37:56 INFO - PROCESS | certutil | 08:37:56 INFO - Certificate Nickname Trust Attributes 08:37:56 INFO - SSL,S/MIME,JAR/XPI 08:37:56 INFO - 08:37:56 INFO - web-platform-tests CT,, 08:37:56 INFO - 08:37:56 INFO - Application command: C:\slave\test\build\application\firefox\firefox.exe -marionette about:blank -profile c:\users\cltbld~1.t-w\appdata\local\temp\tmpve8_ww.mozrunner 08:37:56 INFO - Starting runner 08:37:56 INFO - PROCESS | 3164 | [3164] WARNING: Failed to load startupcache file correctly, removing!: file c:/builds/moz2_slave/m-aurora-w64-d-000000000000000/build/src/startupcache/StartupCache.cpp, line 219 08:37:56 INFO - PROCESS | 3164 | [3164] WARNING: NS_ENSURE_SUCCESS(rv, rv) failed with result 0x80004005: file c:/builds/moz2_slave/m-aurora-w64-d-000000000000000/build/src/xpcom/base/nsSystemInfo.cpp, line 116 08:37:57 INFO - PROCESS | 3164 | [3164] WARNING: This method is lossy. Use GetCanonicalPath !: file c:/builds/moz2_slave/m-aurora-w64-d-000000000000000/build/src/xpcom/io/nsLocalFileWin.cpp, line 3576 08:37:58 INFO - PROCESS | 3164 | 1482424678821 Marionette DEBUG Marionette enabled via build flag and pref 08:37:59 INFO - PROCESS | 3164 | ++DOCSHELL 000000A8C0D40000 == 1 [pid = 3164] [id = 1] 08:37:59 INFO - PROCESS | 3164 | ++DOMWINDOW == 1 (000000A8CDE10000) [pid = 3164] [serial = 1] [outer = 0000000000000000] 08:37:59 INFO - PROCESS | 3164 | ++DOMWINDOW == 2 (000000A8CDE11000) [pid = 3164] [serial = 2] [outer = 000000A8CDE10000] 08:38:00 INFO - PROCESS | 3164 | ++DOCSHELL 000000A8CDE0A000 == 2 [pid = 3164] [id = 2] 08:38:00 INFO - PROCESS | 3164 | ++DOMWINDOW == 3 (000000A8D1F62800) [pid = 3164] [serial = 3] [outer = 0000000000000000] 08:38:00 INFO - PROCESS | 3164 | ++DOMWINDOW == 4 (000000A8D1F63800) [pid = 3164] [serial = 4] [outer = 000000A8D1F62800] 08:38:00 INFO - PROCESS | 3164 | 1482424680860 Marionette INFO Listening on port 2830 08:38:02 INFO - PROCESS | 3164 | 1482424682740 Marionette DEBUG Marionette enabled via command-line flag 08:38:02 INFO - PROCESS | 3164 | ++DOCSHELL 000000A8D301C000 == 3 [pid = 3164] [id = 3] 08:38:02 INFO - PROCESS | 3164 | ++DOMWINDOW == 5 (000000A8D3202800) [pid = 3164] [serial = 5] [outer = 0000000000000000] 08:38:02 INFO - PROCESS | 3164 | ++DOMWINDOW == 6 (000000A8D3203800) [pid = 3164] [serial = 6] [outer = 000000A8D3202800] 08:38:02 INFO - PROCESS | 3164 | ++DOMWINDOW == 7 (000000A8D320C000) [pid = 3164] [serial = 7] [outer = 000000A8D1F62800] 08:38:03 INFO - PROCESS | 3164 | 1482424682993 Marionette DEBUG Accepted connection conn0 from 127.0.0.1:49340 08:38:03 INFO - PROCESS | 3164 | 1482424683014 Marionette DEBUG Accepted connection conn1 from 127.0.0.1:49341 08:38:03 INFO - PROCESS | 3164 | 1482424683023 Marionette DEBUG Accepted connection conn2 from 127.0.0.1:49342 08:38:03 INFO - PROCESS | 3164 | 1482424683056 Marionette DEBUG Accepted connection conn3 from 127.0.0.1:49343 08:38:03 INFO - PROCESS | 3164 | 1482424683061 Marionette DEBUG Closed connection conn0 08:38:03 INFO - PROCESS | 3164 | 1482424683063 Marionette DEBUG Closed connection conn1 08:38:03 INFO - PROCESS | 3164 | 1482424683065 Marionette DEBUG Closed connection conn2 08:38:03 INFO - PROCESS | 3164 | 1482424683146 Marionette DEBUG Closed connection conn3 08:38:03 INFO - PROCESS | 3164 | 1482424683152 Marionette DEBUG Accepted connection conn4 from 127.0.0.1:49344 08:38:03 INFO - PROCESS | 3164 | 1482424683168 Marionette DEBUG Closed connection conn4 08:38:03 INFO - PROCESS | 3164 | 1482424683176 Marionette DEBUG Accepted connection conn5 from 127.0.0.1:49345 08:38:03 INFO - PROCESS | 3164 | ++DOCSHELL 000000A8CDE0F800 == 4 [pid = 3164] [id = 4] 08:38:03 INFO - PROCESS | 3164 | ++DOMWINDOW == 8 (000000A8D445B000) [pid = 3164] [serial = 8] [outer = 0000000000000000] 08:38:03 INFO - PROCESS | 3164 | ++DOMWINDOW == 9 (000000A8D6A81800) [pid = 3164] [serial = 9] [outer = 000000A8D445B000] 08:38:03 INFO - PROCESS | 3164 | ++DOMWINDOW == 10 (000000A8D6A8C800) [pid = 3164] [serial = 10] [outer = 000000A8D445B000] 08:38:03 INFO - PROCESS | 3164 | 1482424683358 Marionette TRACE conn5 -> [0,1,"newSession",{"sessionId":null,"capabilities":null}] 08:38:03 INFO - PROCESS | 3164 | 1482424683363 Marionette CONFIG Changing capabilities: {"browserName":"firefox","browserVersion":"52.0a2","platformName":"windows_nt","platformVersion":"6.2","acceptInsecureCerts":false,"rotatable":false,"proxy":{},"specificationLevel":0,"moz:processID":3164,"moz:profile":"c:\\users\\cltbld~1.t-w\\appdata\\local\\temp\\tmpve8_ww.mozrunner","moz:accessibilityChecks":false} 08:38:03 INFO - PROCESS | 3164 | [3164] WARNING: getting z level of unregistered window: file c:/builds/moz2_slave/m-aurora-w64-d-000000000000000/build/src/xpfe/appshell/nsWindowMediator.cpp, line 623 08:38:03 INFO - PROCESS | 3164 | [3164] WARNING: getting z level of unregistered window: file c:/builds/moz2_slave/m-aurora-w64-d-000000000000000/build/src/xpfe/appshell/nsWindowMediator.cpp, line 623 08:38:03 INFO - PROCESS | 3164 | [3164] WARNING: NS_ENSURE_TRUE(layerManager) failed: file c:/builds/moz2_slave/m-aurora-w64-d-000000000000000/build/src/dom/media/MediaDecoder.cpp, line 301 08:38:04 INFO - PROCESS | 3164 | [3164] WARNING: attempt to modify an immutable nsStandardURL: file c:/builds/moz2_slave/m-aurora-w64-d-000000000000000/build/src/netwerk/base/nsStandardURL.cpp, line 1566 08:38:04 INFO - PROCESS | 3164 | [3164] WARNING: attempt to modify an immutable nsStandardURL: file c:/builds/moz2_slave/m-aurora-w64-d-000000000000000/build/src/netwerk/base/nsStandardURL.cpp, line 1566 08:38:04 INFO - PROCESS | 3164 | [3164] WARNING: Failed to retarget HTML data delivery to the parser thread.: file c:/builds/moz2_slave/m-aurora-w64-d-000000000000000/build/src/parser/html/nsHtml5StreamParser.cpp, line 970 08:38:04 INFO - PROCESS | 3164 | ++DOCSHELL 000000A8D8BE8800 == 5 [pid = 3164] [id = 5] 08:38:04 INFO - PROCESS | 3164 | ++DOMWINDOW == 11 (000000A8D95D2800) [pid = 3164] [serial = 11] [outer = 0000000000000000] 08:38:04 INFO - PROCESS | 3164 | ++DOCSHELL 000000A8D8BF1800 == 6 [pid = 3164] [id = 6] 08:38:04 INFO - PROCESS | 3164 | ++DOMWINDOW == 12 (000000A8D95D3800) [pid = 3164] [serial = 12] [outer = 0000000000000000] 08:38:05 INFO - PROCESS | 3164 | ++DOCSHELL 000000A8DA9CA000 == 7 [pid = 3164] [id = 7] 08:38:05 INFO - PROCESS | 3164 | ++DOMWINDOW == 13 (000000A8DA9CA800) [pid = 3164] [serial = 13] [outer = 0000000000000000] 08:38:05 INFO - PROCESS | 3164 | ++DOMWINDOW == 14 (000000A8DAD8F800) [pid = 3164] [serial = 14] [outer = 000000A8DA9CA800] 08:38:05 INFO - PROCESS | 3164 | ++DOMWINDOW == 15 (000000A8CC868800) [pid = 3164] [serial = 15] [outer = 000000A8D95D2800] 08:38:05 INFO - PROCESS | 3164 | ++DOMWINDOW == 16 (000000A8DB056000) [pid = 3164] [serial = 16] [outer = 000000A8D95D3800] 08:38:05 INFO - PROCESS | 3164 | ++DOMWINDOW == 17 (000000A8DB05A800) [pid = 3164] [serial = 17] [outer = 000000A8DA9CA800] 08:38:06 INFO - PROCESS | 3164 | 1482424686351 Marionette DEBUG loaded listener.js 08:38:06 INFO - PROCESS | 3164 | JavaScript error: chrome://marionette/content/driver.js, line 228: ReferenceError: data is not defined 08:38:07 INFO - PROCESS | 3164 | ++DOMWINDOW == 18 (000000A8DD279800) [pid = 3164] [serial = 18] [outer = 000000A8DA9CA800] 08:38:09 INFO - PROCESS | 3164 | --DOCSHELL 000000A8C0D40000 == 6 [pid = 3164] [id = 1] 08:38:11 INFO - PROCESS | 3164 | --DOCSHELL 000000A8CDE0F800 == 5 [pid = 3164] [id = 4] 08:38:12 INFO - PROCESS | 3164 | ++DOCSHELL 000000A8CC85C000 == 6 [pid = 3164] [id = 8] 08:38:12 INFO - PROCESS | 3164 | ++DOMWINDOW == 19 (000000A8CC85C800) [pid = 3164] [serial = 19] [outer = 0000000000000000] 08:38:12 INFO - PROCESS | 3164 | ++DOMWINDOW == 20 (000000A8CC85E000) [pid = 3164] [serial = 20] [outer = 000000A8CC85C800] 08:38:12 INFO - PROCESS | 3164 | ++DOMWINDOW == 21 (000000A8CCA4B800) [pid = 3164] [serial = 21] [outer = 000000A8CC85C800] 08:38:12 INFO - PROCESS | 3164 | ++DOCSHELL 000000A8CC436800 == 7 [pid = 3164] [id = 9] 08:38:12 INFO - PROCESS | 3164 | ++DOMWINDOW == 22 (000000A8CCA5A800) [pid = 3164] [serial = 22] [outer = 0000000000000000] 08:38:12 INFO - PROCESS | 3164 | ++DOMWINDOW == 23 (000000A8CCAAA000) [pid = 3164] [serial = 23] [outer = 000000A8CCA5A800] 08:38:12 INFO - PROCESS | 3164 | [3164] WARNING: Could not get disk status from nsIDiskSpaceWatcher: file c:/builds/moz2_slave/m-aurora-w64-d-000000000000000/build/src/uriloader/prefetch/nsOfflineCacheUpdateService.cpp, line 283 08:38:12 INFO - PROCESS | 3164 | ++DOMWINDOW == 24 (000000A8CCB3C000) [pid = 3164] [serial = 24] [outer = 000000A8CCA5A800] 08:38:18 INFO - PROCESS | 3164 | [3164] WARNING: NS_ENSURE_TRUE(layerManager) failed: file c:/builds/moz2_slave/m-aurora-w64-d-000000000000000/build/src/dom/media/MediaDecoder.cpp, line 301 08:38:18 INFO - PROCESS | 3164 | [3164] WARNING: NS_ENSURE_TRUE(layerManager) failed: file c:/builds/moz2_slave/m-aurora-w64-d-000000000000000/build/src/dom/media/MediaDecoder.cpp, line 301 08:38:18 INFO - PROCESS | 3164 | --DOMWINDOW == 23 (000000A8CDE10000) [pid = 3164] [serial = 1] [outer = 0000000000000000] [url = chrome://gfxsanity/content/sanityparent.html] 08:38:18 INFO - PROCESS | 3164 | --DOMWINDOW == 22 (000000A8D445B000) [pid = 3164] [serial = 8] [outer = 0000000000000000] [url = chrome://gfxsanity/content/sanitytest.html] 08:38:23 INFO - PROCESS | 3164 | --DOMWINDOW == 21 (000000A8DAD8F800) [pid = 3164] [serial = 14] [outer = 0000000000000000] [url = about:blank] 08:38:23 INFO - PROCESS | 3164 | --DOMWINDOW == 20 (000000A8D6A81800) [pid = 3164] [serial = 9] [outer = 0000000000000000] [url = about:blank] 08:38:23 INFO - PROCESS | 3164 | --DOMWINDOW == 19 (000000A8D6A8C800) [pid = 3164] [serial = 10] [outer = 0000000000000000] [url = chrome://gfxsanity/content/sanitytest.html] 08:38:23 INFO - PROCESS | 3164 | --DOMWINDOW == 18 (000000A8D1F63800) [pid = 3164] [serial = 4] [outer = 0000000000000000] [url = about:blank] 08:38:23 INFO - PROCESS | 3164 | --DOMWINDOW == 17 (000000A8CDE11000) [pid = 3164] [serial = 2] [outer = 0000000000000000] [url = about:blank] 08:38:31 INFO - PROCESS | 3164 | --DOMWINDOW == 16 (000000A8CC85E000) [pid = 3164] [serial = 20] [outer = 0000000000000000] [url = about:blank] 08:38:31 INFO - PROCESS | 3164 | --DOMWINDOW == 15 (000000A8CCAAA000) [pid = 3164] [serial = 23] [outer = 0000000000000000] [url = about:blank] 08:38:31 INFO - PROCESS | 3164 | --DOMWINDOW == 14 (000000A8DB05A800) [pid = 3164] [serial = 17] [outer = 0000000000000000] [url = about:blank] 08:38:42 INFO - PROCESS | 3164 | ++DOMWINDOW == 15 (000000A8CCAA4000) [pid = 3164] [serial = 25] [outer = 000000A8CCA5A800] 08:38:55 WARNING - Init failed 3 08:38:55 WARNING - u'log' (u'warning', {'message': 'Starting marionette session failed: [Errno 10054] An existing connection was forcibly closed by the remote host'}) 08:38:55 WARNING - u'log' (u'warning', {'message': 'Failed to connect to Marionette'}) 08:38:55 WARNING - 'init_failed' () 08:38:55 WARNING - u'runner_teardown' () 08:38:55 INFO - Setting up ssl 08:38:56 INFO - PROCESS | certutil | 08:38:56 INFO - PROCESS | certutil | 08:38:56 INFO - PROCESS | certutil | 08:38:56 INFO - Certificate Nickname Trust Attributes 08:38:56 INFO - SSL,S/MIME,JAR/XPI 08:38:56 INFO - 08:38:56 INFO - web-platform-tests CT,, 08:38:56 INFO - 08:38:56 INFO - Application command: C:\slave\test\build\application\firefox\firefox.exe -marionette about:blank -profile c:\users\cltbld~1.t-w\appdata\local\temp\tmpxycnv2.mozrunner 08:38:56 INFO - Starting runner 08:38:56 INFO - PROCESS | 2484 | [2484] WARNING: Failed to load startupcache file correctly, removing!: file c:/builds/moz2_slave/m-aurora-w64-d-000000000000000/build/src/startupcache/StartupCache.cpp, line 219 08:38:56 INFO - PROCESS | 2484 | [2484] WARNING: NS_ENSURE_SUCCESS(rv, rv) failed with result 0x80004005: file c:/builds/moz2_slave/m-aurora-w64-d-000000000000000/build/src/xpcom/base/nsSystemInfo.cpp, line 116 08:38:57 INFO - PROCESS | 2484 | [2484] WARNING: This method is lossy. Use GetCanonicalPath !: file c:/builds/moz2_slave/m-aurora-w64-d-000000000000000/build/src/xpcom/io/nsLocalFileWin.cpp, line 3576 08:38:58 INFO - PROCESS | 2484 | 1482424738910 Marionette DEBUG Marionette enabled via build flag and pref 08:38:59 INFO - PROCESS | 2484 | ++DOCSHELL 000000A4C2140000 == 1 [pid = 2484] [id = 1] 08:38:59 INFO - PROCESS | 2484 | ++DOMWINDOW == 1 (000000A4CF056000) [pid = 2484] [serial = 1] [outer = 0000000000000000] 08:38:59 INFO - PROCESS | 2484 | ++DOMWINDOW == 2 (000000A4CF057000) [pid = 2484] [serial = 2] [outer = 000000A4CF056000] 08:39:00 INFO - PROCESS | 2484 | ++DOCSHELL 000000A4CF370800 == 2 [pid = 2484] [id = 2] 08:39:00 INFO - PROCESS | 2484 | ++DOMWINDOW == 3 (000000A4D3446000) [pid = 2484] [serial = 3] [outer = 0000000000000000] 08:39:00 INFO - PROCESS | 2484 | ++DOMWINDOW == 4 (000000A4D3447000) [pid = 2484] [serial = 4] [outer = 000000A4D3446000] 08:39:00 INFO - PROCESS | 2484 | 1482424740617 Marionette INFO Listening on port 2831 08:39:02 INFO - PROCESS | 2484 | 1482424742445 Marionette DEBUG Marionette enabled via command-line flag 08:39:02 INFO - PROCESS | 2484 | ++DOCSHELL 000000A4D4512000 == 3 [pid = 2484] [id = 3] 08:39:02 INFO - PROCESS | 2484 | ++DOMWINDOW == 5 (000000A4D4522000) [pid = 2484] [serial = 5] [outer = 0000000000000000] 08:39:02 INFO - PROCESS | 2484 | ++DOMWINDOW == 6 (000000A4D45DC800) [pid = 2484] [serial = 6] [outer = 000000A4D4522000] 08:39:02 INFO - PROCESS | 2484 | ++DOMWINDOW == 7 (000000A4D504E000) [pid = 2484] [serial = 7] [outer = 000000A4D3446000] 08:39:02 INFO - PROCESS | 2484 | 1482424742712 Marionette DEBUG Accepted connection conn0 from 127.0.0.1:49355 08:39:02 INFO - PROCESS | 2484 | 1482424742718 Marionette DEBUG Accepted connection conn1 from 127.0.0.1:49356 08:39:02 INFO - PROCESS | 2484 | 1482424742727 Marionette DEBUG Accepted connection conn2 from 127.0.0.1:49357 08:39:02 INFO - PROCESS | 2484 | 1482424742758 Marionette DEBUG Closed connection conn0 08:39:02 INFO - PROCESS | 2484 | 1482424742760 Marionette DEBUG Closed connection conn1 08:39:02 INFO - PROCESS | 2484 | 1482424742824 Marionette DEBUG Closed connection conn2 08:39:02 INFO - PROCESS | 2484 | 1482424742831 Marionette DEBUG Accepted connection conn3 from 127.0.0.1:49358 08:39:02 INFO - PROCESS | 2484 | 1482424742861 Marionette DEBUG Closed connection conn3 08:39:02 INFO - PROCESS | 2484 | 1482424742867 Marionette DEBUG Accepted connection conn4 from 127.0.0.1:49359 08:39:02 INFO - PROCESS | 2484 | ++DOCSHELL 000000A4CF055800 == 4 [pid = 2484] [id = 4] 08:39:02 INFO - PROCESS | 2484 | ++DOMWINDOW == 8 (000000A4D5982000) [pid = 2484] [serial = 8] [outer = 0000000000000000] 08:39:02 INFO - PROCESS | 2484 | ++DOMWINDOW == 9 (000000A4D5994800) [pid = 2484] [serial = 9] [outer = 000000A4D5982000] 08:39:03 INFO - PROCESS | 2484 | ++DOMWINDOW == 10 (000000A4D7E7F000) [pid = 2484] [serial = 10] [outer = 000000A4D5982000] 08:39:03 INFO - PROCESS | 2484 | 1482424743047 Marionette TRACE conn4 -> [0,1,"newSession",{"sessionId":null,"capabilities":null}] 08:39:03 INFO - PROCESS | 2484 | 1482424743052 Marionette CONFIG Changing capabilities: {"browserName":"firefox","browserVersion":"52.0a2","platformName":"windows_nt","platformVersion":"6.2","acceptInsecureCerts":false,"rotatable":false,"proxy":{},"specificationLevel":0,"moz:processID":2484,"moz:profile":"c:\\users\\cltbld~1.t-w\\appdata\\local\\temp\\tmpxycnv2.mozrunner","moz:accessibilityChecks":false} 08:39:03 INFO - PROCESS | 2484 | [2484] WARNING: getting z level of unregistered window: file c:/builds/moz2_slave/m-aurora-w64-d-000000000000000/build/src/xpfe/appshell/nsWindowMediator.cpp, line 623 08:39:03 INFO - PROCESS | 2484 | [2484] WARNING: getting z level of unregistered window: file c:/builds/moz2_slave/m-aurora-w64-d-000000000000000/build/src/xpfe/appshell/nsWindowMediator.cpp, line 623 08:39:03 INFO - PROCESS | 2484 | [2484] WARNING: NS_ENSURE_TRUE(layerManager) failed: file c:/builds/moz2_slave/m-aurora-w64-d-000000000000000/build/src/dom/media/MediaDecoder.cpp, line 301 08:39:03 INFO - PROCESS | 2484 | [2484] WARNING: attempt to modify an immutable nsStandardURL: file c:/builds/moz2_slave/m-aurora-w64-d-000000000000000/build/src/netwerk/base/nsStandardURL.cpp, line 1566 08:39:03 INFO - PROCESS | 2484 | [2484] WARNING: attempt to modify an immutable nsStandardURL: file c:/builds/moz2_slave/m-aurora-w64-d-000000000000000/build/src/netwerk/base/nsStandardURL.cpp, line 1566 08:39:03 INFO - PROCESS | 2484 | [2484] WARNING: Failed to retarget HTML data delivery to the parser thread.: file c:/builds/moz2_slave/m-aurora-w64-d-000000000000000/build/src/parser/html/nsHtml5StreamParser.cpp, line 970 08:39:04 INFO - PROCESS | 2484 | ++DOCSHELL 000000A4DACB1000 == 5 [pid = 2484] [id = 5] 08:39:04 INFO - PROCESS | 2484 | ++DOMWINDOW == 11 (000000A4DACB1800) [pid = 2484] [serial = 11] [outer = 0000000000000000] 08:39:04 INFO - PROCESS | 2484 | ++DOCSHELL 000000A4DACB3000 == 6 [pid = 2484] [id = 6] 08:39:04 INFO - PROCESS | 2484 | ++DOMWINDOW == 12 (000000A4DACB3800) [pid = 2484] [serial = 12] [outer = 0000000000000000] 08:39:05 INFO - PROCESS | 2484 | ++DOCSHELL 000000A4DBEDD800 == 7 [pid = 2484] [id = 7] 08:39:05 INFO - PROCESS | 2484 | ++DOMWINDOW == 13 (000000A4DBEDE000) [pid = 2484] [serial = 13] [outer = 0000000000000000] 08:39:05 INFO - PROCESS | 2484 | ++DOMWINDOW == 14 (000000A4DB778000) [pid = 2484] [serial = 14] [outer = 000000A4DBEDE000] 08:39:05 INFO - PROCESS | 2484 | ++DOMWINDOW == 15 (000000A4DB788000) [pid = 2484] [serial = 15] [outer = 000000A4DACB1800] 08:39:05 INFO - PROCESS | 2484 | ++DOMWINDOW == 16 (000000A4DC517800) [pid = 2484] [serial = 16] [outer = 000000A4DACB3800] 08:39:05 INFO - PROCESS | 2484 | ++DOMWINDOW == 17 (000000A4DC51C000) [pid = 2484] [serial = 17] [outer = 000000A4DBEDE000] 08:39:06 INFO - PROCESS | 2484 | 1482424746058 Marionette DEBUG loaded listener.js 08:39:06 INFO - PROCESS | 2484 | JavaScript error: chrome://marionette/content/driver.js, line 228: ReferenceError: data is not defined 08:39:07 INFO - PROCESS | 2484 | ++DOMWINDOW == 18 (000000A4DCC21000) [pid = 2484] [serial = 18] [outer = 000000A4DBEDE000] 08:39:09 INFO - PROCESS | 2484 | --DOCSHELL 000000A4C2140000 == 6 [pid = 2484] [id = 1] 08:39:11 INFO - PROCESS | 2484 | --DOCSHELL 000000A4CF055800 == 5 [pid = 2484] [id = 4] 08:39:11 INFO - PROCESS | 2484 | ++DOCSHELL 000000A4CDC99000 == 6 [pid = 2484] [id = 8] 08:39:11 INFO - PROCESS | 2484 | ++DOMWINDOW == 19 (000000A4CDC9E000) [pid = 2484] [serial = 19] [outer = 0000000000000000] 08:39:11 INFO - PROCESS | 2484 | ++DOMWINDOW == 20 (000000A4CDCAA000) [pid = 2484] [serial = 20] [outer = 000000A4CDC9E000] 08:39:12 INFO - PROCESS | 2484 | ++DOMWINDOW == 21 (000000A4CDE5A800) [pid = 2484] [serial = 21] [outer = 000000A4CDC9E000] 08:39:12 INFO - PROCESS | 2484 | ++DOCSHELL 000000A4CD836800 == 7 [pid = 2484] [id = 9] 08:39:12 INFO - PROCESS | 2484 | ++DOMWINDOW == 22 (000000A4CDEA7800) [pid = 2484] [serial = 22] [outer = 0000000000000000] 08:39:12 INFO - PROCESS | 2484 | ++DOMWINDOW == 23 (000000A4CDEB7800) [pid = 2484] [serial = 23] [outer = 000000A4CDEA7800] 08:39:12 INFO - PROCESS | 2484 | [2484] WARNING: Could not get disk status from nsIDiskSpaceWatcher: file c:/builds/moz2_slave/m-aurora-w64-d-000000000000000/build/src/uriloader/prefetch/nsOfflineCacheUpdateService.cpp, line 283 08:39:12 INFO - PROCESS | 2484 | ++DOMWINDOW == 24 (000000A4CDFBC800) [pid = 2484] [serial = 24] [outer = 000000A4CDEA7800] 08:39:18 INFO - PROCESS | 2484 | [2484] WARNING: NS_ENSURE_TRUE(layerManager) failed: file c:/builds/moz2_slave/m-aurora-w64-d-000000000000000/build/src/dom/media/MediaDecoder.cpp, line 301 08:39:18 INFO - PROCESS | 2484 | [2484] WARNING: NS_ENSURE_TRUE(layerManager) failed: file c:/builds/moz2_slave/m-aurora-w64-d-000000000000000/build/src/dom/media/MediaDecoder.cpp, line 301 08:39:18 INFO - PROCESS | 2484 | --DOMWINDOW == 23 (000000A4CF056000) [pid = 2484] [serial = 1] [outer = 0000000000000000] [url = chrome://gfxsanity/content/sanityparent.html] 08:39:18 INFO - PROCESS | 2484 | --DOMWINDOW == 22 (000000A4D5982000) [pid = 2484] [serial = 8] [outer = 0000000000000000] [url = chrome://gfxsanity/content/sanitytest.html] 08:39:23 INFO - PROCESS | 2484 | --DOMWINDOW == 21 (000000A4DB778000) [pid = 2484] [serial = 14] [outer = 0000000000000000] [url = about:blank] 08:39:23 INFO - PROCESS | 2484 | --DOMWINDOW == 20 (000000A4D5994800) [pid = 2484] [serial = 9] [outer = 0000000000000000] [url = about:blank] 08:39:23 INFO - PROCESS | 2484 | --DOMWINDOW == 19 (000000A4D7E7F000) [pid = 2484] [serial = 10] [outer = 0000000000000000] [url = chrome://gfxsanity/content/sanitytest.html] 08:39:23 INFO - PROCESS | 2484 | --DOMWINDOW == 18 (000000A4D3447000) [pid = 2484] [serial = 4] [outer = 0000000000000000] [url = about:blank] 08:39:23 INFO - PROCESS | 2484 | --DOMWINDOW == 17 (000000A4CF057000) [pid = 2484] [serial = 2] [outer = 0000000000000000] [url = about:blank] 08:39:30 INFO - PROCESS | 2484 | --DOMWINDOW == 16 (000000A4CDCAA000) [pid = 2484] [serial = 20] [outer = 0000000000000000] [url = about:blank] 08:39:30 INFO - PROCESS | 2484 | --DOMWINDOW == 15 (000000A4CDEB7800) [pid = 2484] [serial = 23] [outer = 0000000000000000] [url = about:blank] 08:39:30 INFO - PROCESS | 2484 | --DOMWINDOW == 14 (000000A4DC51C000) [pid = 2484] [serial = 17] [outer = 0000000000000000] [url = about:blank] 08:39:42 INFO - PROCESS | 2484 | ++DOMWINDOW == 15 (000000A4CDCB1000) [pid = 2484] [serial = 25] [outer = 000000A4CDEA7800] 08:39:55 WARNING - Init failed 4 08:39:55 WARNING - u'log' (u'warning', {'message': 'Starting marionette session failed: [Errno 10054] An existing connection was forcibly closed by the remote host'}) 08:39:55 WARNING - u'log' (u'warning', {'message': 'Failed to connect to Marionette'}) 08:39:55 WARNING - 'init_failed' () 08:39:55 WARNING - u'runner_teardown' () 08:39:56 INFO - Setting up ssl 08:39:56 INFO - PROCESS | certutil | 08:39:56 INFO - PROCESS | certutil | 08:39:56 INFO - PROCESS | certutil | 08:39:56 INFO - Certificate Nickname Trust Attributes 08:39:56 INFO - SSL,S/MIME,JAR/XPI 08:39:56 INFO - 08:39:56 INFO - web-platform-tests CT,, 08:39:56 INFO - 08:39:56 INFO - Application command: C:\slave\test\build\application\firefox\firefox.exe -marionette about:blank -profile c:\users\cltbld~1.t-w\appdata\local\temp\tmpeqg7ir.mozrunner 08:39:56 INFO - Starting runner 08:39:56 INFO - PROCESS | 2984 | [2984] WARNING: Failed to load startupcache file correctly, removing!: file c:/builds/moz2_slave/m-aurora-w64-d-000000000000000/build/src/startupcache/StartupCache.cpp, line 219 08:39:57 INFO - PROCESS | 2984 | [2984] WARNING: NS_ENSURE_SUCCESS(rv, rv) failed with result 0x80004005: file c:/builds/moz2_slave/m-aurora-w64-d-000000000000000/build/src/xpcom/base/nsSystemInfo.cpp, line 116 08:39:57 INFO - PROCESS | 2984 | [2984] WARNING: This method is lossy. Use GetCanonicalPath !: file c:/builds/moz2_slave/m-aurora-w64-d-000000000000000/build/src/xpcom/io/nsLocalFileWin.cpp, line 3576 08:39:59 INFO - PROCESS | 2984 | 1482424799169 Marionette DEBUG Marionette enabled via build flag and pref 08:40:00 INFO - PROCESS | 2984 | ++DOCSHELL 0000008949B40000 == 1 [pid = 2984] [id = 1] 08:40:00 INFO - PROCESS | 2984 | ++DOMWINDOW == 1 (0000008956B3C000) [pid = 2984] [serial = 1] [outer = 0000000000000000] 08:40:00 INFO - PROCESS | 2984 | ++DOMWINDOW == 2 (0000008956B3D000) [pid = 2984] [serial = 2] [outer = 0000008956B3C000] 08:40:00 INFO - PROCESS | 2984 | ++DOCSHELL 0000008956B36000 == 2 [pid = 2984] [id = 2] 08:40:00 INFO - PROCESS | 2984 | ++DOMWINDOW == 3 (000000895AE6F000) [pid = 2984] [serial = 3] [outer = 0000000000000000] 08:40:00 INFO - PROCESS | 2984 | ++DOMWINDOW == 4 (000000895AE70000) [pid = 2984] [serial = 4] [outer = 000000895AE6F000] 08:40:00 INFO - PROCESS | 2984 | 1482424800849 Marionette INFO Listening on port 2832 08:40:02 INFO - PROCESS | 2984 | 1482424802649 Marionette DEBUG Marionette enabled via command-line flag 08:40:02 INFO - PROCESS | 2984 | ++DOCSHELL 000000895BF30800 == 3 [pid = 2984] [id = 3] 08:40:02 INFO - PROCESS | 2984 | ++DOMWINDOW == 5 (000000895C113000) [pid = 2984] [serial = 5] [outer = 0000000000000000] 08:40:02 INFO - PROCESS | 2984 | ++DOMWINDOW == 6 (000000895C114000) [pid = 2984] [serial = 6] [outer = 000000895C113000] 08:40:02 INFO - PROCESS | 2984 | ++DOMWINDOW == 7 (000000895BF39800) [pid = 2984] [serial = 7] [outer = 000000895AE6F000] 08:40:02 INFO - PROCESS | 2984 | 1482424802902 Marionette DEBUG Accepted connection conn0 from 127.0.0.1:49368 08:40:02 INFO - PROCESS | 2984 | 1482424802923 Marionette DEBUG Accepted connection conn1 from 127.0.0.1:49369 08:40:02 INFO - PROCESS | 2984 | 1482424802931 Marionette DEBUG Accepted connection conn2 from 127.0.0.1:49370 08:40:02 INFO - PROCESS | 2984 | 1482424802962 Marionette DEBUG Closed connection conn0 08:40:02 INFO - PROCESS | 2984 | 1482424802965 Marionette DEBUG Closed connection conn1 08:40:03 INFO - PROCESS | 2984 | 1482424803028 Marionette DEBUG Closed connection conn2 08:40:03 INFO - PROCESS | 2984 | 1482424803035 Marionette DEBUG Accepted connection conn3 from 127.0.0.1:49371 08:40:03 INFO - PROCESS | 2984 | 1482424803065 Marionette DEBUG Closed connection conn3 08:40:03 INFO - PROCESS | 2984 | 1482424803072 Marionette DEBUG Accepted connection conn4 from 127.0.0.1:49372 08:40:03 INFO - PROCESS | 2984 | ++DOCSHELL 0000008956B3B800 == 4 [pid = 2984] [id = 4] 08:40:03 INFO - PROCESS | 2984 | ++DOMWINDOW == 8 (000000895D181800) [pid = 2984] [serial = 8] [outer = 0000000000000000] 08:40:03 INFO - PROCESS | 2984 | ++DOMWINDOW == 9 (000000895F862800) [pid = 2984] [serial = 9] [outer = 000000895D181800] 08:40:03 INFO - PROCESS | 2984 | ++DOMWINDOW == 10 (000000895F86D800) [pid = 2984] [serial = 10] [outer = 000000895D181800] 08:40:03 INFO - PROCESS | 2984 | 1482424803252 Marionette TRACE conn4 -> [0,1,"newSession",{"sessionId":null,"capabilities":null}] 08:40:03 INFO - PROCESS | 2984 | 1482424803258 Marionette CONFIG Changing capabilities: {"browserName":"firefox","browserVersion":"52.0a2","platformName":"windows_nt","platformVersion":"6.2","acceptInsecureCerts":false,"rotatable":false,"proxy":{},"specificationLevel":0,"moz:processID":2984,"moz:profile":"c:\\users\\cltbld~1.t-w\\appdata\\local\\temp\\tmpeqg7ir.mozrunner","moz:accessibilityChecks":false} 08:40:03 INFO - PROCESS | 2984 | [2984] WARNING: getting z level of unregistered window: file c:/builds/moz2_slave/m-aurora-w64-d-000000000000000/build/src/xpfe/appshell/nsWindowMediator.cpp, line 623 08:40:03 INFO - PROCESS | 2984 | [2984] WARNING: getting z level of unregistered window: file c:/builds/moz2_slave/m-aurora-w64-d-000000000000000/build/src/xpfe/appshell/nsWindowMediator.cpp, line 623 08:40:03 INFO - PROCESS | 2984 | [2984] WARNING: NS_ENSURE_TRUE(layerManager) failed: file c:/builds/moz2_slave/m-aurora-w64-d-000000000000000/build/src/dom/media/MediaDecoder.cpp, line 301 08:40:03 INFO - PROCESS | 2984 | [2984] WARNING: attempt to modify an immutable nsStandardURL: file c:/builds/moz2_slave/m-aurora-w64-d-000000000000000/build/src/netwerk/base/nsStandardURL.cpp, line 1566 08:40:03 INFO - PROCESS | 2984 | [2984] WARNING: attempt to modify an immutable nsStandardURL: file c:/builds/moz2_slave/m-aurora-w64-d-000000000000000/build/src/netwerk/base/nsStandardURL.cpp, line 1566 08:40:03 INFO - PROCESS | 2984 | [2984] WARNING: Failed to retarget HTML data delivery to the parser thread.: file c:/builds/moz2_slave/m-aurora-w64-d-000000000000000/build/src/parser/html/nsHtml5StreamParser.cpp, line 970 08:40:04 INFO - PROCESS | 2984 | ++DOCSHELL 000000895CE32000 == 5 [pid = 2984] [id = 5] 08:40:04 INFO - PROCESS | 2984 | ++DOMWINDOW == 11 (000000896043F000) [pid = 2984] [serial = 11] [outer = 0000000000000000] 08:40:04 INFO - PROCESS | 2984 | ++DOCSHELL 0000008962EBF800 == 6 [pid = 2984] [id = 6] 08:40:04 INFO - PROCESS | 2984 | ++DOMWINDOW == 12 (0000008962EC0000) [pid = 2984] [serial = 12] [outer = 0000000000000000] 08:40:05 INFO - PROCESS | 2984 | ++DOCSHELL 000000896405E800 == 7 [pid = 2984] [id = 7] 08:40:05 INFO - PROCESS | 2984 | ++DOMWINDOW == 13 (000000896405F000) [pid = 2984] [serial = 13] [outer = 0000000000000000] 08:40:05 INFO - PROCESS | 2984 | ++DOMWINDOW == 14 (0000008964069800) [pid = 2984] [serial = 14] [outer = 000000896405F000] 08:40:05 INFO - PROCESS | 2984 | ++DOMWINDOW == 15 (0000008955768000) [pid = 2984] [serial = 15] [outer = 000000896043F000] 08:40:05 INFO - PROCESS | 2984 | ++DOMWINDOW == 16 (0000008964121800) [pid = 2984] [serial = 16] [outer = 0000008962EC0000] 08:40:05 INFO - PROCESS | 2984 | ++DOMWINDOW == 17 (0000008964126800) [pid = 2984] [serial = 17] [outer = 000000896405F000] 08:40:06 INFO - PROCESS | 2984 | 1482424806203 Marionette DEBUG loaded listener.js 08:40:06 INFO - PROCESS | 2984 | JavaScript error: chrome://marionette/content/driver.js, line 228: ReferenceError: data is not defined 08:40:07 INFO - PROCESS | 2984 | ++DOMWINDOW == 18 (0000008964125000) [pid = 2984] [serial = 18] [outer = 000000896405F000] 08:40:10 INFO - PROCESS | 2984 | --DOCSHELL 0000008949B40000 == 6 [pid = 2984] [id = 1] 08:40:11 INFO - PROCESS | 2984 | --DOCSHELL 0000008956B3B800 == 5 [pid = 2984] [id = 4] 08:40:12 INFO - PROCESS | 2984 | ++DOCSHELL 0000008955769800 == 6 [pid = 2984] [id = 8] 08:40:12 INFO - PROCESS | 2984 | ++DOMWINDOW == 19 (000000895576A000) [pid = 2984] [serial = 19] [outer = 0000000000000000] 08:40:12 INFO - PROCESS | 2984 | ++DOMWINDOW == 20 (0000008955773800) [pid = 2984] [serial = 20] [outer = 000000895576A000] 08:40:12 INFO - PROCESS | 2984 | ++DOMWINDOW == 21 (0000008955955800) [pid = 2984] [serial = 21] [outer = 000000895576A000] 08:40:12 INFO - PROCESS | 2984 | ++DOCSHELL 00000089549BF800 == 7 [pid = 2984] [id = 9] 08:40:12 INFO - PROCESS | 2984 | ++DOMWINDOW == 22 (0000008955966800) [pid = 2984] [serial = 22] [outer = 0000000000000000] 08:40:12 INFO - PROCESS | 2984 | ++DOMWINDOW == 23 (00000089559B2000) [pid = 2984] [serial = 23] [outer = 0000008955966800] 08:40:12 INFO - PROCESS | 2984 | [2984] WARNING: Could not get disk status from nsIDiskSpaceWatcher: file c:/builds/moz2_slave/m-aurora-w64-d-000000000000000/build/src/uriloader/prefetch/nsOfflineCacheUpdateService.cpp, line 283 08:40:12 INFO - PROCESS | 2984 | ++DOMWINDOW == 24 (0000008955AB6000) [pid = 2984] [serial = 24] [outer = 0000008955966800] 08:40:18 INFO - PROCESS | 2984 | [2984] WARNING: NS_ENSURE_TRUE(layerManager) failed: file c:/builds/moz2_slave/m-aurora-w64-d-000000000000000/build/src/dom/media/MediaDecoder.cpp, line 301 08:40:18 INFO - PROCESS | 2984 | [2984] WARNING: NS_ENSURE_TRUE(layerManager) failed: file c:/builds/moz2_slave/m-aurora-w64-d-000000000000000/build/src/dom/media/MediaDecoder.cpp, line 301 08:40:18 INFO - PROCESS | 2984 | --DOMWINDOW == 23 (0000008956B3C000) [pid = 2984] [serial = 1] [outer = 0000000000000000] [url = chrome://gfxsanity/content/sanityparent.html] 08:40:18 INFO - PROCESS | 2984 | --DOMWINDOW == 22 (000000895D181800) [pid = 2984] [serial = 8] [outer = 0000000000000000] [url = chrome://gfxsanity/content/sanitytest.html] 08:40:24 INFO - PROCESS | 2984 | --DOMWINDOW == 21 (0000008964069800) [pid = 2984] [serial = 14] [outer = 0000000000000000] [url = about:blank] 08:40:24 INFO - PROCESS | 2984 | --DOMWINDOW == 20 (000000895F862800) [pid = 2984] [serial = 9] [outer = 0000000000000000] [url = about:blank] 08:40:24 INFO - PROCESS | 2984 | --DOMWINDOW == 19 (000000895F86D800) [pid = 2984] [serial = 10] [outer = 0000000000000000] [url = chrome://gfxsanity/content/sanitytest.html] 08:40:24 INFO - PROCESS | 2984 | --DOMWINDOW == 18 (000000895AE70000) [pid = 2984] [serial = 4] [outer = 0000000000000000] [url = about:blank] 08:40:24 INFO - PROCESS | 2984 | --DOMWINDOW == 17 (0000008956B3D000) [pid = 2984] [serial = 2] [outer = 0000000000000000] [url = about:blank] 08:40:31 INFO - PROCESS | 2984 | --DOMWINDOW == 16 (0000008955773800) [pid = 2984] [serial = 20] [outer = 0000000000000000] [url = about:blank] 08:40:31 INFO - PROCESS | 2984 | --DOMWINDOW == 15 (0000008964126800) [pid = 2984] [serial = 17] [outer = 0000000000000000] [url = about:blank] 08:40:31 INFO - PROCESS | 2984 | --DOMWINDOW == 14 (00000089559B2000) [pid = 2984] [serial = 23] [outer = 0000000000000000] [url = about:blank] 08:40:42 INFO - PROCESS | 2984 | ++DOMWINDOW == 15 (00000089557AD000) [pid = 2984] [serial = 25] [outer = 0000008955966800] 08:40:55 WARNING - Init failed 5 08:40:55 CRITICAL - Test runner failed to initialise correctly; shutting down 08:40:55 WARNING - u'log' (u'warning', {'message': 'Starting marionette session failed: [Errno 10054] An existing connection was forcibly closed by the remote host'}) 08:40:55 WARNING - u'log' (u'warning', {'message': 'Failed to connect to Marionette'}) 08:40:55 WARNING - 'init_failed' () 08:40:55 WARNING - u'runner_teardown' () 08:40:55 INFO - STDERR: Traceback (most recent call last): 08:40:55 INFO - Got 0 unexpected results 08:40:55 INFO - STDERR: File "c:\mozilla-build\python27\Lib\multiprocessing\queues.py", line 262, in _feed 08:40:55 INFO - SUITE-END | took 300s 08:40:55 INFO - Closing logging queue 08:40:55 INFO - queue closed 08:40:55 INFO - Return code: 0 08:40:55 CRITICAL - # TBPL FAILURE # 08:40:55 WARNING - setting return code to 2 08:40:55 INFO - Running post-action listener: _resource_record_post_action 08:40:55 INFO - [mozharness: 2016-12-22 16:40:55.746000Z] Finished run-tests step (success) 08:40:55 INFO - Running post-run listener: _resource_record_post_run 08:40:55 INFO - Total resource usage - Wall time: 310s; CPU: 4.0%; Read bytes: 125924352; Write bytes: 240382976; Read time: 1895980; Write time: 4591780 08:40:55 INFO - TinderboxPrint: CPU usage
3.7% 08:40:55 INFO - TinderboxPrint: I/O read bytes / time
125,924,352 / 1,895,980 08:40:55 INFO - TinderboxPrint: I/O write bytes / time
240,382,976 / 4,591,780 08:40:55 INFO - TinderboxPrint: CPU idle
2,384.8 (96.3%) 08:40:55 INFO - TinderboxPrint: CPU user
81.1 (3.3%) 08:40:55 INFO - pull - Wall time: 0s; CPU: Can't collect data; Read bytes: 0; Write bytes: 0; Read time: 0; Write time: 0 08:40:55 INFO - install - Wall time: 3s; CPU: 12.0%; Read bytes: 0; Write bytes: 25907712; Read time: 0; Write time: 144610 08:40:55 INFO - run-tests - Wall time: 308s; CPU: 4.0%; Read bytes: 125924352; Write bytes: 126124544; Read time: 1895980; Write time: 4390300 08:40:55 WARNING - could not upload resource usage JSON 08:40:55 WARNING - Traceback (most recent call last): 08:40:55 WARNING - 08:40:55 WARNING - File "C:\slave\test\scripts\mozharness\base\python.py", line 623, in _resource_record_post_run 08:40:55 WARNING - json.dump(self._resource_monitor.as_dict(), fh, 08:40:55 WARNING - 08:40:55 WARNING - File "C:\slave\test\build\venv\Lib\site-packages\mozsystemmonitor\resourcemonitor.py", line 663, in as_dict 08:40:55 WARNING - cpu_logical_count=psutil.cpu_count(logical=True), 08:40:55 WARNING - 08:40:55 WARNING - AttributeError: 'module' object has no attribute 'cpu_count' 08:40:55 WARNING - 08:40:55 INFO - Running post-run listener: _upload_blobber_files 08:40:55 INFO - Blob upload gear active. 08:40:55 INFO - Preparing to upload files from C:\slave\test\build\blobber_upload_dir. 08:40:55 INFO - Files from C:\slave\test\build\blobber_upload_dir are to be uploaded with branch at the following location(s): https://blobupload.elasticbeanstalk.com 08:40:55 INFO - Running command: ['C:\\slave\\test\\build\\venv\\Scripts\\python', 'C:\\slave\\test\\build\\venv\\Scripts\\blobberc.py', '-u', 'https://blobupload.elasticbeanstalk.com', '-a', 'C:\\slave\\test\\oauth.txt', '-b', 'mozilla-aurora', '-d', 'C:\\slave\\test\\build\\blobber_upload_dir', '--output-manifest', 'C:\\slave\\test\\build\\uploaded_files.json'] 08:40:55 INFO - Copy/paste: C:\slave\test\build\venv\Scripts\python C:\slave\test\build\venv\Scripts\blobberc.py -u https://blobupload.elasticbeanstalk.com -a C:\slave\test\oauth.txt -b mozilla-aurora -d C:\slave\test\build\blobber_upload_dir --output-manifest C:\slave\test\build\uploaded_files.json 08:40:56 INFO - (blobuploader) - INFO - Open directory for files ... 08:40:56 INFO - (blobuploader) - INFO - Uploading C:\slave\test\build\blobber_upload_dir\resource-usage.json ... 08:40:56 INFO - (blobuploader) - INFO - Using https://blobupload.elasticbeanstalk.com 08:40:56 INFO - (blobuploader) - INFO - Uploading, attempt #1. 08:40:57 INFO - (blobuploader) - INFO - TinderboxPrint: resource-usage.json: uploaded 08:40:57 INFO - (blobuploader) - INFO - Blobserver returned 202. File uploaded! 08:40:57 INFO - (blobuploader) - INFO - Done attempting. 08:40:57 INFO - (blobuploader) - INFO - Uploading C:\slave\test\build\blobber_upload_dir\wpt_errorsummary.log ... 08:40:57 INFO - (blobuploader) - INFO - Using https://blobupload.elasticbeanstalk.com 08:40:57 INFO - (blobuploader) - INFO - Uploading, attempt #1. 08:40:57 INFO - (blobuploader) - INFO - TinderboxPrint: wpt_errorsummary.log: uploaded 08:40:57 INFO - (blobuploader) - INFO - Blobserver returned 202. File uploaded! 08:40:57 INFO - (blobuploader) - INFO - Done attempting. 08:40:57 INFO - (blobuploader) - INFO - Uploading C:\slave\test\build\blobber_upload_dir\wpt_raw.log ... 08:40:57 INFO - (blobuploader) - INFO - Using https://blobupload.elasticbeanstalk.com 08:40:57 INFO - (blobuploader) - INFO - Uploading, attempt #1. 08:40:58 INFO - (blobuploader) - INFO - TinderboxPrint: wpt_raw.log: uploaded 08:40:58 INFO - (blobuploader) - INFO - Blobserver returned 202. File uploaded! 08:40:58 INFO - (blobuploader) - INFO - Done attempting. 08:40:58 INFO - (blobuploader) - INFO - Iteration through files over. 08:40:58 INFO - Return code: 0 08:40:58 INFO - rmtree: C:\slave\test\build\uploaded_files.json 08:40:58 INFO - Using _rmtree_windows ... 08:40:58 INFO - retry: Calling _rmtree_windows with args: ('C:\\slave\\test\\build\\uploaded_files.json',), kwargs: {}, attempt #1 08:40:58 INFO - Setting buildbot property blobber_files to {"wpt_errorsummary.log": "http://mozilla-releng-blobs.s3.amazonaws.com/blobs/mozilla-aurora/sha512/313585ae1c9ac2b8adcc542dbbaae7055de4625052314badaffc9d5dafe7308daf1ae79f5cdd7383329cdaed4f12233849cd6b9bd0814dadb54e783295b077fb", "resource-usage.json": "http://mozilla-releng-blobs.s3.amazonaws.com/blobs/mozilla-aurora/sha512/cf83e1357eefb8bdf1542850d66d8007d620e4050b5715dc83f4a921d36ce9ce47d0d13c5d85f2b0ff8318d2877eec2f63b931bd47417a81a538327af927da3e", "wpt_raw.log": "http://mozilla-releng-blobs.s3.amazonaws.com/blobs/mozilla-aurora/sha512/18c82b19e3bde7a92ad93f7f5f8e469d41f1865f305f206ff4845438c5d4231bd3f96cdfedf416dfb0fa33c72b69bcf5e8abc11034a7780f018b8d93ce681651"} 08:40:58 INFO - Writing buildbot properties ['blobber_files'] to C:\slave\test\properties\blobber_files 08:40:58 INFO - Writing to file C:\slave\test\properties\blobber_files 08:40:58 INFO - Contents: 08:40:58 INFO - blobber_files:{"wpt_errorsummary.log": "http://mozilla-releng-blobs.s3.amazonaws.com/blobs/mozilla-aurora/sha512/313585ae1c9ac2b8adcc542dbbaae7055de4625052314badaffc9d5dafe7308daf1ae79f5cdd7383329cdaed4f12233849cd6b9bd0814dadb54e783295b077fb", "resource-usage.json": "http://mozilla-releng-blobs.s3.amazonaws.com/blobs/mozilla-aurora/sha512/cf83e1357eefb8bdf1542850d66d8007d620e4050b5715dc83f4a921d36ce9ce47d0d13c5d85f2b0ff8318d2877eec2f63b931bd47417a81a538327af927da3e", "wpt_raw.log": "http://mozilla-releng-blobs.s3.amazonaws.com/blobs/mozilla-aurora/sha512/18c82b19e3bde7a92ad93f7f5f8e469d41f1865f305f206ff4845438c5d4231bd3f96cdfedf416dfb0fa33c72b69bcf5e8abc11034a7780f018b8d93ce681651"} 08:40:58 INFO - Running post-run listener: copy_logs_to_upload_dir 08:40:58 INFO - Copying logs to upload dir... 08:40:58 INFO - mkdir: C:\slave\test\build\upload\logs 08:40:58 INFO - Copying logs to upload dir... 08:40:58 INFO - Using _rmtree_windows ... 08:40:58 INFO - Using _rmtree_windows ... 08:40:58 INFO - Using _rmtree_windows ... 08:40:58 INFO - Using _rmtree_windows ... 08:40:58 INFO - Using _rmtree_windows ... 08:40:58 INFO - Using _rmtree_windows ... 08:40:58 INFO - Using _rmtree_windows ... 08:40:58 WARNING - returning nonzero exit status 2 program finished with exit code 2 elapsedTime=506.237000 ========= master_lag: 0.30 ========= ========= Finished 'c:/mozilla-build/python27/python -u ...' failed (results: 2, elapsed: 8 mins, 26 secs) (at 2016-12-22 08:40:58.811126) ========= ========= Started set props: build_url blobber_files symbols_url (results: 0, elapsed: 0 secs) (at 2016-12-22 08:40:58.812283) ========= 'cmd' '/C' 'for' '%f' 'in' '(*)' 'do' '@type' '%f' in dir C:\slave\test\properties (timeout 1200 secs) watching logfiles {} argv: ['cmd', '/C', 'for', '%f', 'in', '(*)', 'do', '@type', '%f'] environment: ALLUSERSPROFILE=C:\ProgramData APPDATA=C:\Users\cltbld.T-W864-IX-303\AppData\Roaming COMMONPROGRAMFILES=C:\Program Files (x86)\Common Files COMMONPROGRAMFILES(X86)=C:\Program Files (x86)\Common Files COMMONPROGRAMW6432=C:\Program Files\Common Files COMPUTERNAME=T-W864-IX-303 COMSPEC=C:\windows\system32\cmd.exe DCLOCATION=SCL3 DNSSUFFIX=wintest.releng.scl3.mozilla.com FP_NO_HOST_CHECK=NO HOMEDRIVE=C: HOMEPATH=\Users\cltbld.T-W864-IX-303 KTS_HOME=C:\Program Files\KTS KTS_VERSION=1.19c LOCALAPPDATA=C:\Users\cltbld.T-W864-IX-303\AppData\Local LOGONSERVER=\\T-W864-IX-303 MONDIR=C:\Monitor_config\ MOZBUILDDIR=C:\mozilla-build\ NUMBER_OF_PROCESSORS=8 OS=Windows_NT OURDRIVE=C: PATH=C:\Program Files (x86)\NVIDIA Corporation\PhysX\Common;C:\windows\system32;C:\windows;C:\windows\System32\Wbem;C:\windows\System32\WindowsPowerShell\v1.0\;C:\mozilla-build\python27;C:\mozilla-build\python27\Scripts;C:\mozilla-build\msys\bin;C:\mozilla-build\vim\vim72;C:\mozilla-build\wget;C:\mozilla-build\info-zip;C:\CoreUtils\bin;C:\mozilla-build\buildbotve\scripts;C:\mozilla-build\hg PATHEXT=.COM;.EXE;.BAT;.CMD;.VBS;.VBE;.JS;.JSE;.WSF;.WSH;.MSC PROCESSOR_ARCHITECTURE=x86 PROCESSOR_ARCHITEW6432=AMD64 PROCESSOR_IDENTIFIER=Intel64 Family 6 Model 30 Stepping 5, GenuineIntel PROCESSOR_LEVEL=6 PROCESSOR_REVISION=1e05 PROGRAMDATA=C:\ProgramData PROGRAMFILES=C:\Program Files (x86) PROGRAMFILES(X86)=C:\Program Files (x86) PROGRAMW6432=C:\Program Files PROMPT=$P$G PSMODULEPATH=C:\windows\system32\WindowsPowerShell\v1.0\Modules\ PUBLIC=C:\Users\Public PWD=C:\slave\test\properties RUNLOGFILE=C:\slave\\runslave.log SLAVEDIR=C:\slave\ SYSTEMDRIVE=C: SYSTEMROOT=C:\windows TEMP=C:\Users\CLTBLD~1.T-W\AppData\Local\Temp TEST1=testie TMP=C:\Users\CLTBLD~1.T-W\AppData\Local\Temp USERDOMAIN=T-W864-IX-303 USERDOMAIN_ROAMINGPROFILE=T-W864-IX-303 USERNAME=cltbld USERPROFILE=C:\Users\cltbld.T-W864-IX-303 WINDIR=C:\windows using PTY: False blobber_files:{"wpt_errorsummary.log": "http://mozilla-releng-blobs.s3.amazonaws.com/blobs/mozilla-aurora/sha512/313585ae1c9ac2b8adcc542dbbaae7055de4625052314badaffc9d5dafe7308daf1ae79f5cdd7383329cdaed4f12233849cd6b9bd0814dadb54e783295b077fb", "resource-usage.json": "http://mozilla-releng-blobs.s3.amazonaws.com/blobs/mozilla-aurora/sha512/cf83e1357eefb8bdf1542850d66d8007d620e4050b5715dc83f4a921d36ce9ce47d0d13c5d85f2b0ff8318d2877eec2f63b931bd47417a81a538327af927da3e", "wpt_raw.log": "http://mozilla-releng-blobs.s3.amazonaws.com/blobs/mozilla-aurora/sha512/18c82b19e3bde7a92ad93f7f5f8e469d41f1865f305f206ff4845438c5d4231bd3f96cdfedf416dfb0fa33c72b69bcf5e8abc11034a7780f018b8d93ce681651"} build_url:https://queue.taskcluster.net/v1/task/BGboJK_ERvKTPFUls4AHYA/artifacts/public/build/firefox-52.0a2.en-US.win64.zip symbols_url:https://queue.taskcluster.net/v1/task/BGboJK_ERvKTPFUls4AHYA/artifacts/public/build/firefox-52.0a2.en-US.win64.crashreporter-symbols.zip program finished with exit code 0 elapsedTime=0.101000 build_url: 'https://queue.taskcluster.net/v1/task/BGboJK_ERvKTPFUls4AHYA/artifacts/public/build/firefox-52.0a2.en-US.win64.zip' blobber_files: '{"wpt_errorsummary.log": "http://mozilla-releng-blobs.s3.amazonaws.com/blobs/mozilla-aurora/sha512/313585ae1c9ac2b8adcc542dbbaae7055de4625052314badaffc9d5dafe7308daf1ae79f5cdd7383329cdaed4f12233849cd6b9bd0814dadb54e783295b077fb", "resource-usage.json": "http://mozilla-releng-blobs.s3.amazonaws.com/blobs/mozilla-aurora/sha512/cf83e1357eefb8bdf1542850d66d8007d620e4050b5715dc83f4a921d36ce9ce47d0d13c5d85f2b0ff8318d2877eec2f63b931bd47417a81a538327af927da3e", "wpt_raw.log": "http://mozilla-releng-blobs.s3.amazonaws.com/blobs/mozilla-aurora/sha512/18c82b19e3bde7a92ad93f7f5f8e469d41f1865f305f206ff4845438c5d4231bd3f96cdfedf416dfb0fa33c72b69bcf5e8abc11034a7780f018b8d93ce681651"}' symbols_url: 'https://queue.taskcluster.net/v1/task/BGboJK_ERvKTPFUls4AHYA/artifacts/public/build/firefox-52.0a2.en-US.win64.crashreporter-symbols.zip' ========= master_lag: 0.03 ========= ========= Finished set props: build_url blobber_files symbols_url (results: 0, elapsed: 0 secs) (at 2016-12-22 08:40:58.938817) ========= ========= Started 'rm -f ...' (results: 0, elapsed: 0 secs) (at 2016-12-22 08:40:58.939220) ========= 'rm' '-f' 'oauth.txt' in dir C:\slave\test\. (timeout 1200 secs) watching logfiles {} argv: ['rm', '-f', 'oauth.txt'] environment: ALLUSERSPROFILE=C:\ProgramData APPDATA=C:\Users\cltbld.T-W864-IX-303\AppData\Roaming COMMONPROGRAMFILES=C:\Program Files (x86)\Common Files COMMONPROGRAMFILES(X86)=C:\Program Files (x86)\Common Files COMMONPROGRAMW6432=C:\Program Files\Common Files COMPUTERNAME=T-W864-IX-303 COMSPEC=C:\windows\system32\cmd.exe DCLOCATION=SCL3 DNSSUFFIX=wintest.releng.scl3.mozilla.com FP_NO_HOST_CHECK=NO HOMEDRIVE=C: HOMEPATH=\Users\cltbld.T-W864-IX-303 KTS_HOME=C:\Program Files\KTS KTS_VERSION=1.19c LOCALAPPDATA=C:\Users\cltbld.T-W864-IX-303\AppData\Local LOGONSERVER=\\T-W864-IX-303 MONDIR=C:\Monitor_config\ MOZBUILDDIR=C:\mozilla-build\ NUMBER_OF_PROCESSORS=8 OS=Windows_NT OURDRIVE=C: PATH=C:\Program Files (x86)\NVIDIA Corporation\PhysX\Common;C:\windows\system32;C:\windows;C:\windows\System32\Wbem;C:\windows\System32\WindowsPowerShell\v1.0\;C:\mozilla-build\python27;C:\mozilla-build\python27\Scripts;C:\mozilla-build\msys\bin;C:\mozilla-build\vim\vim72;C:\mozilla-build\wget;C:\mozilla-build\info-zip;C:\CoreUtils\bin;C:\mozilla-build\buildbotve\scripts;C:\mozilla-build\hg PATHEXT=.COM;.EXE;.BAT;.CMD;.VBS;.VBE;.JS;.JSE;.WSF;.WSH;.MSC PROCESSOR_ARCHITECTURE=x86 PROCESSOR_ARCHITEW6432=AMD64 PROCESSOR_IDENTIFIER=Intel64 Family 6 Model 30 Stepping 5, GenuineIntel PROCESSOR_LEVEL=6 PROCESSOR_REVISION=1e05 PROGRAMDATA=C:\ProgramData PROGRAMFILES=C:\Program Files (x86) PROGRAMFILES(X86)=C:\Program Files (x86) PROGRAMW6432=C:\Program Files PROMPT=$P$G PSMODULEPATH=C:\windows\system32\WindowsPowerShell\v1.0\Modules\ PUBLIC=C:\Users\Public PWD=C:\slave\test RUNLOGFILE=C:\slave\\runslave.log SLAVEDIR=C:\slave\ SYSTEMDRIVE=C: SYSTEMROOT=C:\windows TEMP=C:\Users\CLTBLD~1.T-W\AppData\Local\Temp TEST1=testie TMP=C:\Users\CLTBLD~1.T-W\AppData\Local\Temp USERDOMAIN=T-W864-IX-303 USERDOMAIN_ROAMINGPROFILE=T-W864-IX-303 USERNAME=cltbld USERPROFILE=C:\Users\cltbld.T-W864-IX-303 WINDIR=C:\windows using PTY: False program finished with exit code 0 elapsedTime=0.101000 ========= master_lag: 0.02 ========= ========= Finished 'rm -f ...' (results: 0, elapsed: 0 secs) (at 2016-12-22 08:40:59.065070) ========= ========= Started reboot slave lost (results: 0, elapsed: 1 secs) (at 2016-12-22 08:40:59.065755) ========= ========= Finished reboot slave lost (results: 0, elapsed: 1 secs) (at 2016-12-22 08:41:00.230691) ========= ========= Total master_lag: 6.38 =========